﻿2026-07-29T09:51:06.3820486Z ##[group]Run cargo test --workspace --lib --bins
2026-07-29T09:51:06.3821688Z [36;1mcargo test --workspace --lib --bins[0m
2026-07-29T09:51:06.3836326Z shell: /usr/bin/bash -e {0}
2026-07-29T09:51:06.3837337Z ##[endgroup]
2026-07-29T09:51:06.6740789Z    Compiling proc-macro2 v1.0.106
2026-07-29T09:51:06.6742261Z    Compiling quote v1.0.45
2026-07-29T09:51:06.6743346Z    Compiling unicode-ident v1.0.24
2026-07-29T09:51:06.6744477Z    Compiling libc v0.2.186
2026-07-29T09:51:06.6745593Z    Compiling serde_core v1.0.228
2026-07-29T09:51:06.6746689Z    Compiling cfg-if v1.0.4
2026-07-29T09:51:06.6767127Z    Compiling serde v1.0.228
2026-07-29T09:51:06.6818034Z    Compiling portable-atomic v1.13.1
2026-07-29T09:51:06.6845789Z    Compiling typenum v1.20.1
2026-07-29T09:51:06.6847862Z    Compiling version_check v0.9.5
2026-07-29T09:51:06.6866038Z    Compiling memchr v2.8.1
2026-07-29T09:51:06.6907364Z    Compiling critical-section v1.2.0
2026-07-29T09:51:06.6967686Z    Compiling log v0.4.32
2026-07-29T09:51:06.7082052Z    Compiling find-msvc-tools v0.1.9
2026-07-29T09:51:06.7084447Z    Compiling shlex v2.0.1
2026-07-29T09:51:06.7255333Z    Compiling subtle v2.6.1
2026-07-29T09:51:06.7647953Z    Compiling smallvec v1.15.1
2026-07-29T09:51:06.8105110Z    Compiling equivalent v1.0.2
2026-07-29T09:51:06.8898797Z    Compiling itoa v1.0.18
2026-07-29T09:51:06.9274836Z    Compiling pin-project-lite v0.2.17
2026-07-29T09:51:06.9361636Z    Compiling semver v1.0.28
2026-07-29T09:51:06.9675127Z    Compiling rand_core v0.10.1
2026-07-29T09:51:06.9925178Z    Compiling bitflags v2.12.1
2026-07-29T09:51:07.0163916Z    Compiling getrandom v0.4.2
2026-07-29T09:51:07.0234118Z    Compiling futures-core v0.3.32
2026-07-29T09:51:07.0237379Z    Compiling bytes v1.11.1
2026-07-29T09:51:07.0421195Z    Compiling cpufeatures v0.2.17
2026-07-29T09:51:07.0653977Z    Compiling generic-array v0.14.7
2026-07-29T09:51:07.0984189Z    Compiling hashbrown v0.17.1
2026-07-29T09:51:07.1301476Z    Compiling stable_deref_trait v1.2.1
2026-07-29T09:51:07.1349678Z    Compiling futures-sink v0.3.32
2026-07-29T09:51:07.1672917Z    Compiling slab v0.4.12
2026-07-29T09:51:07.1799452Z    Compiling futures-io v0.3.32
2026-07-29T09:51:07.2334230Z    Compiling futures-channel v0.3.32
2026-07-29T09:51:07.2731308Z    Compiling rustc_version v0.4.1
2026-07-29T09:51:07.2890997Z    Compiling futures-task v0.3.32
2026-07-29T09:51:07.2990668Z    Compiling rustversion v1.0.22
2026-07-29T09:51:07.3171305Z    Compiling fnv v1.0.7
2026-07-29T09:51:07.3681426Z    Compiling strsim v0.11.1
2026-07-29T09:51:07.3951546Z    Compiling cfg_aliases v0.2.1
2026-07-29T09:51:07.4055822Z    Compiling litemap v0.8.2
2026-07-29T09:51:07.4449098Z    Compiling writeable v0.6.3
2026-07-29T09:51:07.4765336Z    Compiling zerocopy v0.8.50
2026-07-29T09:51:07.4930875Z    Compiling ahash v0.8.12
2026-07-29T09:51:07.5121253Z    Compiling icu_normalizer_data v2.2.0
2026-07-29T09:51:07.6651537Z    Compiling icu_properties_data v2.2.0
2026-07-29T09:51:07.6837870Z    Compiling fs_extra v1.3.0
2026-07-29T09:51:07.6969686Z    Compiling ident_case v1.0.1
2026-07-29T09:51:07.6977026Z    Compiling curve25519-dalek v4.1.3
2026-07-29T09:51:07.6978934Z    Compiling utf8_iter v1.0.4
2026-07-29T09:51:07.8710805Z    Compiling dunce v1.0.5
2026-07-29T09:51:07.9130186Z    Compiling indexmap v2.14.0
2026-07-29T09:51:07.9591309Z    Compiling vcpkg v0.2.15
2026-07-29T09:51:07.9618916Z    Compiling autocfg v1.5.1
2026-07-29T09:51:07.9714248Z    Compiling pkg-config v0.3.33
2026-07-29T09:51:07.9715463Z    Compiling signature v2.2.0
2026-07-29T09:51:07.9800777Z    Compiling zmij v1.0.21
2026-07-29T09:51:08.0776605Z    Compiling syn v2.0.117
2026-07-29T09:51:08.1152957Z    Compiling ed25519 v2.2.3
2026-07-29T09:51:08.1413337Z    Compiling fastrand v2.4.1
2026-07-29T09:51:08.1691211Z    Compiling percent-encoding v2.3.2
2026-07-29T09:51:08.2560543Z    Compiling serde_json v1.0.150
2026-07-29T09:51:08.3270917Z    Compiling http v1.4.1
2026-07-29T09:51:08.3980795Z    Compiling unicode-segmentation v1.13.3
2026-07-29T09:51:08.4081049Z    Compiling cpufeatures v0.3.0
2026-07-29T09:51:08.4350841Z    Compiling thiserror v2.0.18
2026-07-29T09:51:08.4396672Z    Compiling aws-lc-rs v1.17.0
2026-07-29T09:51:08.4650968Z    Compiling jobserver v0.1.34
2026-07-29T09:51:08.5220511Z    Compiling scopeguard v1.2.0
2026-07-29T09:51:08.5411256Z    Compiling fallible-streaming-iterator v0.1.9
2026-07-29T09:51:08.5971728Z    Compiling fallible-iterator v0.3.0
2026-07-29T09:51:08.6350977Z    Compiling lock_api v0.4.14
2026-07-29T09:51:08.6831895Z    Compiling chacha20 v0.10.0
2026-07-29T09:51:08.6954872Z    Compiling form_urlencoded v1.2.2
2026-07-29T09:51:08.7385787Z    Compiling cc v1.2.63
2026-07-29T09:51:08.8050366Z    Compiling crypto-common v0.1.7
2026-07-29T09:51:08.8260879Z    Compiling block-buffer v0.10.4
2026-07-29T09:51:08.9130742Z    Compiling untrusted v0.9.0
2026-07-29T09:51:08.9231135Z    Compiling heck v0.5.0
2026-07-29T09:51:08.9305099Z    Compiling anyhow v1.0.102
2026-07-29T09:51:08.9420621Z    Compiling digest v0.10.7
2026-07-29T09:51:08.9521047Z    Compiling rustls v0.23.40
2026-07-29T09:51:08.9543542Z    Compiling convert_case v0.10.0
2026-07-29T09:51:08.9840742Z    Compiling atomic-waker v1.1.2
2026-07-29T09:51:08.9925262Z    Compiling const-oid v0.10.2
2026-07-29T09:51:09.0134504Z    Compiling unicode-xid v0.2.6
2026-07-29T09:51:09.0420906Z    Compiling parking_lot_core v0.9.12
2026-07-29T09:51:09.0548527Z    Compiling paste v1.0.15
2026-07-29T09:51:09.1043819Z    Compiling httparse v1.10.1
2026-07-29T09:51:09.1125693Z    Compiling num-traits v0.2.19
2026-07-29T09:51:09.1621031Z    Compiling sha2 v0.10.9
2026-07-29T09:51:09.1831080Z    Compiling hybrid-array v0.4.12
2026-07-29T09:51:09.1905987Z    Compiling base64ct v1.8.3
2026-07-29T09:51:09.2290867Z    Compiling rustix v1.1.4
2026-07-29T09:51:09.2877041Z    Compiling either v1.16.0
2026-07-29T09:51:09.3060588Z    Compiling powerfmt v0.2.0
2026-07-29T09:51:09.3820478Z    Compiling getrandom v0.2.17
2026-07-29T09:51:09.4763579Z    Compiling mio v1.2.1
2026-07-29T09:51:09.4966927Z    Compiling socket2 v0.6.4
2026-07-29T09:51:09.5422338Z    Compiling rand_core v0.6.4
2026-07-29T09:51:09.5427878Z    Compiling fs2 v0.4.3
2026-07-29T09:51:09.5941604Z    Compiling http-body v1.0.1
2026-07-29T09:51:09.7101476Z    Compiling uuid v1.23.2
2026-07-29T09:51:09.7405913Z    Compiling rand v0.10.1
2026-07-29T09:51:09.7548871Z    Compiling deranged v0.5.8
2026-07-29T09:51:09.7621103Z    Compiling pem-rfc7468 v1.0.0
2026-07-29T09:51:09.8300617Z    Compiling ref-cast v1.0.25
2026-07-29T09:51:10.0124652Z    Compiling cmake v0.1.58
2026-07-29T09:51:10.0266706Z    Compiling base64 v0.22.1
2026-07-29T09:51:10.0613386Z    Compiling tower-service v0.3.3
2026-07-29T09:51:10.1073030Z    Compiling data-encoding v2.11.0
2026-07-29T09:51:10.1220567Z    Compiling num-conv v0.2.2
2026-07-29T09:51:10.1516223Z    Compiling time-core v0.1.8
2026-07-29T09:51:10.2183144Z    Compiling linux-raw-sys v0.12.1
2026-07-29T09:51:10.2263919Z    Compiling tinyvec_macros v0.1.1
2026-07-29T09:51:10.2440861Z    Compiling try-lock v0.2.5
2026-07-29T09:51:10.3045733Z    Compiling tinyvec v1.11.0
2026-07-29T09:51:10.3440331Z    Compiling want v0.3.1
2026-07-29T09:51:10.3616568Z    Compiling parking_lot v0.12.5
2026-07-29T09:51:10.3770722Z    Compiling crypto-common v0.2.2
2026-07-29T09:51:10.3950687Z    Compiling block-buffer v0.12.0
2026-07-29T09:51:10.4671785Z    Compiling inout v0.1.4
2026-07-29T09:51:10.5090360Z    Compiling vergen-lib v9.1.0
2026-07-29T09:51:10.5616949Z    Compiling aho-corasick v1.1.4
2026-07-29T09:51:10.5650349Z    Compiling n0-future v0.3.2
2026-07-29T09:51:10.6170348Z    Compiling winnow v1.0.3
2026-07-29T09:51:10.7337358Z    Compiling winnow v0.7.15
2026-07-29T09:51:10.7342158Z    Compiling cordyceps v0.3.4
2026-07-29T09:51:10.8359113Z    Compiling httpdate v1.0.3
2026-07-29T09:51:10.8630388Z    Compiling crossbeam-utils v0.8.21
2026-07-29T09:51:10.9640776Z    Compiling spin v0.10.0
2026-07-29T09:51:11.0430637Z    Compiling aws-lc-sys v0.41.0
2026-07-29T09:51:11.0770756Z    Compiling libsqlite3-sys v0.30.1
2026-07-29T09:51:11.1287340Z    Compiling ring v0.17.14
2026-07-29T09:51:11.1395307Z    Compiling diatomic-waker v0.2.3
2026-07-29T09:51:11.2280253Z    Compiling toml_write v0.1.2
2026-07-29T09:51:11.2566937Z    Compiling parking v2.2.1
2026-07-29T09:51:11.3288062Z    Compiling regex-syntax v0.8.10
2026-07-29T09:51:11.3742587Z    Compiling futures-lite v2.6.1
2026-07-29T09:51:11.4410470Z    Compiling digest v0.11.3
2026-07-29T09:51:11.4678364Z    Compiling futures-buffered v0.2.13
2026-07-29T09:51:11.6250355Z    Compiling cipher v0.4.4
2026-07-29T09:51:11.6498527Z    Compiling netlink-packet-core v0.8.1
2026-07-29T09:51:11.8940943Z    Compiling universal-hash v0.5.1
2026-07-29T09:51:11.9073607Z    Compiling vergen v9.1.0
2026-07-29T09:51:11.9801041Z    Compiling vergen-lib v0.1.6
2026-07-29T09:51:11.9990532Z    Compiling heapless v0.7.17
2026-07-29T09:51:12.0810690Z    Compiling curve25519-dalek v5.0.0-pre.6
2026-07-29T09:51:12.1516134Z    Compiling noq-udp v0.10.0
2026-07-29T09:51:12.1651010Z    Compiling sync_wrapper v1.0.2
2026-07-29T09:51:12.2041025Z    Compiling byteorder v1.5.0
2026-07-29T09:51:12.2172191Z    Compiling toml_parser v1.1.2+spec-1.1.0
2026-07-29T09:51:12.2445371Z    Compiling dyn-clone v1.0.20
2026-07-29T09:51:12.3071179Z    Compiling allocator-api2 v0.2.21
2026-07-29T09:51:12.3491223Z    Compiling toml_datetime v1.1.1+spec-1.1.0
2026-07-29T09:51:12.3680777Z    Compiling opaque-debug v0.3.1
2026-07-29T09:51:12.4221027Z    Compiling polyval v0.6.2
2026-07-29T09:51:12.4330657Z    Compiling hash32 v0.2.1
2026-07-29T09:51:12.5850903Z    Compiling hmac v0.12.1
2026-07-29T09:51:12.6133863Z    Compiling spin v0.9.8
2026-07-29T09:51:12.6400738Z    Compiling vergen-gitcl v1.0.8
2026-07-29T09:51:12.6890968Z    Compiling ryu v1.0.23
2026-07-29T09:51:12.7068629Z    Compiling arrayvec v0.7.6
2026-07-29T09:51:12.7955815Z    Compiling toml_edit v0.25.12+spec-1.1.0
2026-07-29T09:51:12.8155255Z    Compiling tower-layer v0.3.3
2026-07-29T09:51:12.9231332Z    Compiling synstructure v0.13.2
2026-07-29T09:51:12.9300956Z    Compiling darling_core v0.20.11
2026-07-29T09:51:12.9790672Z    Compiling serde_derive_internals v0.29.1
2026-07-29T09:51:13.0150672Z    Compiling signature v3.0.0
2026-07-29T09:51:13.0620463Z    Compiling num_threads v0.1.7
2026-07-29T09:51:13.1650691Z    Compiling time v0.3.47
2026-07-29T09:51:13.2008167Z    Compiling ghash v0.5.1
2026-07-29T09:51:13.3064669Z    Compiling aes v0.8.4
2026-07-29T09:51:13.3170419Z    Compiling ctr v0.9.2
2026-07-29T09:51:13.3201078Z    Compiling sha2 v0.11.0-rc.5
2026-07-29T09:51:13.5260619Z    Compiling http-body-util v0.1.3
2026-07-29T09:51:13.6480497Z    Compiling proc-macro-crate v3.5.0
2026-07-29T09:51:13.7021594Z    Compiling aead v0.5.2
2026-07-29T09:51:13.8128550Z    Compiling openssl-probe v0.2.1
2026-07-29T09:51:13.8468865Z    Compiling regex-automata v0.4.14
2026-07-29T09:51:14.0030962Z    Compiling utf8parse v0.2.2
2026-07-29T09:51:14.0970369Z    Compiling aes-gcm v0.10.3
2026-07-29T09:51:14.1090872Z    Compiling crossbeam-epoch v0.9.18
2026-07-29T09:51:14.1130274Z    Compiling crossbeam-channel v0.5.15
2026-07-29T09:51:14.2332362Z    Compiling netlink-packet-route v0.29.0
2026-07-29T09:51:14.2660247Z    Compiling blake3 v1.8.5
2026-07-29T09:51:14.2820733Z    Compiling memoffset v0.6.5
2026-07-29T09:51:14.2970806Z    Compiling acto v0.8.2
2026-07-29T09:51:14.3176993Z    Compiling noq v0.18.0
2026-07-29T09:51:14.4402248Z    Compiling netwatch v0.16.0
2026-07-29T09:51:14.5020948Z    Compiling sorted-index-buffer v0.2.1
2026-07-29T09:51:14.5650668Z    Compiling foldhash v0.2.0
2026-07-29T09:51:14.5818167Z    Compiling rustc-hash v2.1.2
2026-07-29T09:51:14.5919854Z    Compiling identity-hash v0.1.0
2026-07-29T09:51:14.6557449Z    Compiling thiserror v1.0.69
2026-07-29T09:51:14.6790417Z    Compiling lru-slab v0.1.2
2026-07-29T09:51:14.6880599Z    Compiling xml-rs v0.8.28
2026-07-29T09:51:14.6881390Z    Compiling mac-addr v0.3.0
2026-07-29T09:51:14.7699699Z    Compiling tagptr v0.2.0
2026-07-29T09:51:14.7961146Z    Compiling hashbrown v0.16.1
2026-07-29T09:51:14.9380691Z    Compiling netlink-packet-route v0.30.0
2026-07-29T09:51:14.9651009Z    Compiling serde_derive v1.0.228
2026-07-29T09:51:15.0110673Z    Compiling zeroize_derive v1.4.3
2026-07-29T09:51:15.0220724Z    Compiling tokio-macros v2.7.0
2026-07-29T09:51:15.3762554Z    Compiling zerofrom-derive v0.1.7
2026-07-29T09:51:15.5490671Z    Compiling futures-macro v0.3.32
2026-07-29T09:51:15.6120670Z    Compiling yoke-derive v0.8.2
2026-07-29T09:51:15.6511683Z    Compiling zeroize v1.8.2
2026-07-29T09:51:15.6667373Z    Compiling curve25519-dalek-derive v0.1.1
2026-07-29T09:51:15.7281186Z    Compiling zerovec-derive v0.11.3
2026-07-29T09:51:15.7560494Z    Compiling tokio v1.52.3
2026-07-29T09:51:15.8332593Z    Compiling displaydoc v0.2.6
2026-07-29T09:51:16.2428809Z    Compiling tracing-attributes v0.1.31
2026-07-29T09:51:16.2711100Z    Compiling rustls-pki-types v1.14.1
2026-07-29T09:51:16.3465201Z    Compiling thiserror-impl v2.0.18
2026-07-29T09:51:16.5187109Z    Compiling futures-util v0.3.32
2026-07-29T09:51:16.9190869Z    Compiling zerofrom v0.1.8
2026-07-29T09:51:16.9450541Z    Compiling darling_macro v0.20.11
2026-07-29T09:51:17.0235417Z    Compiling yoke v0.8.3
2026-07-29T09:51:17.0356954Z    Compiling derive_more-impl v2.1.1
2026-07-29T09:51:17.2380681Z    Compiling zerotrie v0.2.4
2026-07-29T09:51:17.2830758Z    Compiling zerovec v0.11.6
2026-07-29T09:51:17.3209354Z    Compiling darling v0.20.11
2026-07-29T09:51:17.3978745Z    Compiling derive_builder_core v0.20.2
2026-07-29T09:51:17.5935407Z    Compiling ed25519-dalek v2.2.0
2026-07-29T09:51:17.9112368Z    Compiling spt-proto v0.45.0 (/home/reavus/actions-runner/_work/spt-bs-core/spt-bs-core/crates/spt-proto)
2026-07-29T09:51:17.9270470Z    Compiling spez v0.1.2
2026-07-29T09:51:18.0461637Z    Compiling tinystr v0.8.3
2026-07-29T09:51:18.1625968Z    Compiling potential_utf v0.1.5
2026-07-29T09:51:18.2347646Z    Compiling icu_locale_core v2.2.0
2026-07-29T09:51:18.3570593Z    Compiling icu_collections v2.2.0
2026-07-29T09:51:18.3820830Z    Compiling n0-error-macros v0.1.3
2026-07-29T09:51:18.3908082Z    Compiling der v0.8.0-rc.10
2026-07-29T09:51:18.6929900Z    Compiling derive_builder_macro v0.20.2
2026-07-29T09:51:19.0960569Z    Compiling derive_builder v0.20.2
2026-07-29T09:51:19.1069965Z    Compiling ref-cast-impl v1.0.25
2026-07-29T09:51:19.1916260Z    Compiling pin-project-internal v1.1.13
2026-07-29T09:51:19.4150631Z    Compiling icu_provider v2.2.0
2026-07-29T09:51:19.5680626Z    Compiling n0-error v0.1.3
2026-07-29T09:51:19.7719903Z    Compiling icu_normalizer v2.2.0
2026-07-29T09:51:19.8060753Z    Compiling icu_properties v2.2.0
2026-07-29T09:51:19.8101088Z    Compiling spki v0.8.0-rc.4
2026-07-29T09:51:19.9190806Z    Compiling schemars_derive v1.2.1
2026-07-29T09:51:20.0305164Z    Compiling pkcs8 v0.11.0-rc.10
2026-07-29T09:51:20.0510723Z    Compiling regex v1.12.3
2026-07-29T09:51:20.2057097Z    Compiling ipnet v2.12.0
2026-07-29T09:51:20.3449502Z    Compiling serde_spanned v0.6.9
2026-07-29T09:51:20.3809745Z    Compiling toml_datetime v0.6.11
2026-07-29T09:51:20.4758411Z    Compiling futures-executor v0.3.32
2026-07-29T09:51:20.5520576Z    Compiling ed25519 v3.0.0-rc.4
2026-07-29T09:51:20.5886438Z    Compiling pin-project v1.1.13
2026-07-29T09:51:20.6118727Z    Compiling toml_edit v0.22.27
2026-07-29T09:51:20.6650623Z    Compiling futures v0.3.32
2026-07-29T09:51:20.7350605Z    Compiling prefix-trie v0.8.4
2026-07-29T09:51:20.9895995Z    Compiling once_cell v1.21.4
2026-07-29T09:51:21.0060596Z    Compiling cobs v0.3.0
2026-07-29T09:51:21.1520084Z    Compiling postcard-derive v0.2.2
2026-07-29T09:51:21.1642992Z    Compiling tracing-core v0.1.36
2026-07-29T09:51:21.2476137Z    Compiling idna_adapter v1.2.2
2026-07-29T09:51:21.3725581Z    Compiling tokio-util v0.7.18
2026-07-29T09:51:21.4400448Z    Compiling hashbrown v0.14.5
2026-07-29T09:51:21.4590411Z    Compiling idna v1.1.0
2026-07-29T09:51:21.5265465Z    Compiling netlink-sys v0.8.8
2026-07-29T09:51:21.6821336Z    Compiling tracing v0.1.44
2026-07-29T09:51:21.7434264Z    Compiling derive_more v2.1.1
2026-07-29T09:51:21.7869210Z    Compiling data-encoding-macro-internal v0.1.18
2026-07-29T09:51:21.8650666Z    Compiling postcard v1.1.3
2026-07-29T09:51:21.9230669Z    Compiling url v2.5.8
2026-07-29T09:51:22.0500511Z    Compiling schemars v1.2.1
2026-07-29T09:51:22.1160427Z    Compiling ed25519-dalek v3.0.0-pre.6
2026-07-29T09:51:22.2474198Z    Compiling hashlink v0.9.1
2026-07-29T09:51:22.2690334Z    Compiling data-encoding-macro v0.1.20
2026-07-29T09:51:22.3372311Z    Compiling tower v0.5.3
2026-07-29T09:51:22.3411146Z    Compiling tempfile v3.27.0
2026-07-29T09:51:22.5228704Z    Compiling h2 v0.4.14
2026-07-29T09:51:22.6090695Z    Compiling rusqlite v0.32.1
2026-07-29T09:51:22.6512155Z    Compiling rustls-native-certs v0.8.4
2026-07-29T09:51:22.6621004Z    Compiling async-trait v0.1.89
2026-07-29T09:51:22.7286308Z    Compiling hickory-proto v0.26.0-beta.4
2026-07-29T09:51:23.0010528Z    Compiling strum_macros v0.28.0
2026-07-29T09:51:23.0610723Z    Compiling enum-assoc v1.3.0
2026-07-29T09:51:23.2022536Z    Compiling toml v0.8.23
2026-07-29T09:51:23.3050711Z    Compiling num_enum_derive v0.7.6
2026-07-29T09:51:23.3140567Z    Compiling iroh-metrics-derive v0.4.1
2026-07-29T09:51:23.4040035Z    Compiling iroh-relay v0.98.0
2026-07-29T09:51:23.7110483Z    Compiling tower-http v0.6.11
2026-07-29T09:51:23.8300838Z    Compiling spt-store v0.45.0 (/home/reavus/actions-runner/_work/spt-bs-core/spt-bs-core/crates/spt-store)
2026-07-29T09:51:23.8506463Z    Compiling iroh-metrics v0.38.3
2026-07-29T09:51:23.9460718Z    Compiling iroh-base v0.98.0
2026-07-29T09:51:24.2600807Z    Compiling attohttpc v0.30.1
2026-07-29T09:51:24.2996466Z    Compiling n0-watcher v0.6.1
2026-07-29T09:51:24.5130500Z    Compiling num_enum v0.7.6
2026-07-29T09:51:24.5220728Z    Compiling tokio-stream v0.1.18
2026-07-29T09:51:24.5500697Z    Compiling netlink-proto v0.12.0
2026-07-29T09:51:24.6091179Z    Compiling netdev v0.42.0
2026-07-29T09:51:24.7110915Z    Compiling moka v0.12.15
2026-07-29T09:51:24.7550442Z    Compiling xmltree v0.10.3
2026-07-29T09:51:24.7746902Z    Compiling thiserror-impl v1.0.69
2026-07-29T09:51:24.8360753Z    Compiling termios v0.2.2
2026-07-29T09:51:25.0102169Z    Compiling ioctl-rs v0.1.6
2026-07-29T09:51:25.0200573Z    Compiling serial-core v0.4.0
2026-07-29T09:51:25.1090052Z    Compiling simple-dns v0.9.3
2026-07-29T09:51:25.1422790Z    Compiling smol_str v0.1.24
2026-07-29T09:51:25.1641404Z    Compiling resolv-conf v0.7.6
2026-07-29T09:51:25.1729611Z    Compiling constant_time_eq v0.4.2
2026-07-29T09:51:25.2257328Z    Compiling sha1_smol v1.0.1
2026-07-29T09:51:25.3290582Z    Compiling simdutf8 v0.1.5
2026-07-29T09:51:25.3834007Z    Compiling arrayref v0.3.9
2026-07-29T09:51:25.6900862Z    Compiling serial-unix v0.4.0
2026-07-29T09:51:25.7502801Z    Compiling webpki-roots v1.0.7
2026-07-29T09:51:25.7800647Z    Compiling strum v0.28.0
2026-07-29T09:51:25.8638020Z    Compiling lru v0.16.4
2026-07-29T09:51:25.9642701Z    Compiling serde_bytes v0.11.19
2026-07-29T09:51:25.9689321Z    Compiling seize v0.5.1
2026-07-29T09:51:25.9800623Z    Compiling iroh v0.98.2
2026-07-29T09:51:26.0491733Z    Compiling pin-utils v0.1.0
2026-07-29T09:51:26.0975548Z    Compiling cmov v0.5.4
2026-07-29T09:51:26.1062517Z    Compiling bitflags v1.3.2
2026-07-29T09:51:26.1169123Z    Compiling swarm-discovery v0.6.0-alpha.2
2026-07-29T09:51:26.1779423Z    Compiling nix v0.25.1
2026-07-29T09:51:26.1861333Z    Compiling serial v0.4.0
2026-07-29T09:51:26.2005014Z    Compiling papaya v0.2.4
2026-07-29T09:51:26.2611762Z    Compiling backon v1.6.0
2026-07-29T09:51:26.2840610Z    Compiling hkdf v0.12.4
2026-07-29T09:51:26.3050748Z    Compiling vte_generate_state_changes v0.1.2
2026-07-29T09:51:26.3910565Z    Compiling ctutils v0.4.2
2026-07-29T09:51:26.4320980Z    Compiling filedescriptor v0.8.3
2026-07-29T09:51:26.4480736Z    Compiling shell-words v1.1.1
2026-07-29T09:51:26.4550830Z    Compiling unicode-width v0.2.0
2026-07-29T09:51:26.4736199Z    Compiling iroh-dns v0.98.0
2026-07-29T09:51:26.5770909Z    Compiling downcast-rs v1.2.1
2026-07-29T09:51:26.6005246Z    Compiling vte v0.13.1
2026-07-29T09:51:26.6449960Z    Compiling spake2 v0.4.0
2026-07-29T09:51:26.6556110Z    Compiling sha1 v0.10.6
2026-07-29T09:51:26.6623658Z    Compiling unicode-width v0.1.14
2026-07-29T09:51:26.6840438Z    Compiling doctest-file v1.1.1
2026-07-29T09:51:26.7570283Z    Compiling errno v0.3.14
2026-07-29T09:51:26.7820772Z    Compiling signal-hook v0.3.18
2026-07-29T09:51:26.9325519Z    Compiling signal-hook-registry v1.4.8
2026-07-29T09:51:26.9586924Z    Compiling darling_core v0.23.0
2026-07-29T09:51:26.9725265Z    Compiling rustix v0.38.44
2026-07-29T09:51:26.9810719Z    Compiling anstyle-parse v1.0.0
2026-07-29T09:51:26.9939228Z    Compiling anstyle-query v1.1.5
2026-07-29T09:51:27.0125242Z    Compiling linux-raw-sys v0.4.15
2026-07-29T09:51:27.0920731Z    Compiling is_terminal_polyfill v1.70.2
2026-07-29T09:51:27.1710716Z    Compiling interprocess v2.4.2
2026-07-29T09:51:27.1991480Z    Compiling anstyle v1.0.14
2026-07-29T09:51:27.3101125Z    Compiling colorchoice v1.0.5
2026-07-29T09:51:27.3881515Z    Compiling instability v0.3.12
2026-07-29T09:51:27.4130601Z    Compiling foldhash v0.1.5
2026-07-29T09:51:27.4689591Z    Compiling anstream v1.0.0
2026-07-29T09:51:27.5950849Z    Compiling hashbrown v0.15.5
2026-07-29T09:51:27.6110472Z    Compiling signal-hook-mio v0.2.5
2026-07-29T09:51:27.6270925Z    Compiling strum_macros v0.26.4
2026-07-29T09:51:27.7590506Z    Compiling terminal_size v0.4.4
2026-07-29T09:51:27.7850485Z    Compiling itertools v0.13.0
2026-07-29T09:51:27.8970666Z    Compiling spt-msg v0.45.0 (/home/reavus/actions-runner/_work/spt-bs-core/spt-bs-core/crates/spt-msg)
2026-07-29T09:51:27.9040400Z    Compiling castaway v0.2.4
2026-07-29T09:51:28.0040700Z    Compiling bytemuck v1.25.2
2026-07-29T09:51:28.0170642Z    Compiling clap_lex v1.1.0
2026-07-29T09:51:28.0390713Z    Compiling indoc v2.0.7
2026-07-29T09:51:28.2360826Z    Compiling hyper v1.10.1
2026-07-29T09:51:28.3374910Z    Compiling spt-runtime v0.45.0 (/home/reavus/actions-runner/_work/spt-bs-core/spt-bs-core/crates/spt-runtime)
2026-07-29T09:51:28.3740714Z    Compiling static_assertions v1.1.0
2026-07-29T09:51:28.4037575Z    Compiling lru v0.12.5
2026-07-29T09:51:28.4432893Z    Compiling compact_str v0.8.2
2026-07-29T09:51:28.5120957Z    Compiling rgb v0.8.53
2026-07-29T09:51:28.6030824Z    Compiling crossterm v0.28.1
2026-07-29T09:51:28.8491039Z    Compiling clap_builder v4.6.0
2026-07-29T09:51:28.8771384Z    Compiling clap_derive v4.6.1
2026-07-29T09:51:29.0490338Z    Compiling iana-time-zone v0.1.65
2026-07-29T09:51:29.3941030Z    Compiling cassowary v0.3.0
2026-07-29T09:51:29.5630466Z    Compiling chrono v0.4.45
2026-07-29T09:51:29.7800462Z    Compiling unicode-truncate v1.1.0
2026-07-29T09:51:29.9274792Z    Compiling avt v0.18.0
2026-07-29T09:51:30.1740512Z    Compiling hyper-util v0.1.20
2026-07-29T09:51:30.3144919Z    Compiling portable-pty v0.8.1
2026-07-29T09:51:30.3570483Z    Compiling strum v0.26.3
2026-07-29T09:51:30.5072250Z    Compiling spt-test-support v0.45.0 (/home/reavus/actions-runner/_work/spt-bs-core/spt-bs-core/crates/spt-test-support)
2026-07-29T09:51:30.5160534Z    Compiling nucleo-matcher v0.3.1
2026-07-29T09:51:30.5287093Z    Compiling qrcode v0.14.1
2026-07-29T09:51:30.5828701Z    Compiling darling_macro v0.23.0
2026-07-29T09:51:31.0251169Z    Compiling spt-term v0.45.0 (/home/reavus/actions-runner/_work/spt-bs-core/spt-bs-core/crates/spt-term)
2026-07-29T09:51:31.1810856Z    Compiling darling v0.23.0
2026-07-29T09:51:31.5670757Z    Compiling clap v4.6.1
2026-07-29T09:51:31.9000626Z    Compiling ratatui v0.29.0
2026-07-29T09:51:31.9731050Z    Compiling spt-live v0.45.0 (/home/reavus/actions-runner/_work/spt-bs-core/spt-bs-core/crates/spt-live)
2026-07-29T09:51:32.1146379Z    Compiling igd-next v0.17.1
2026-07-29T09:51:33.4135200Z    Compiling portmapper v0.16.0
2026-07-29T09:51:34.5268335Z    Compiling mock-adapter v0.45.0 (/home/reavus/actions-runner/_work/spt-bs-core/spt-bs-core/adapters/mock)
2026-07-29T09:51:41.2078426Z    Compiling rustls-webpki v0.103.13
2026-07-29T09:51:43.5405903Z    Compiling tokio-rustls v0.26.4
2026-07-29T09:51:43.5408619Z    Compiling noq-proto v0.17.0
2026-07-29T09:51:43.5409071Z    Compiling rustls-platform-verifier v0.7.0
2026-07-29T09:51:43.6830858Z    Compiling hickory-net v0.26.0-beta.4
2026-07-29T09:51:43.6832083Z    Compiling hyper-rustls v0.27.9
2026-07-29T09:51:43.6832531Z    Compiling tokio-websockets v0.13.2
2026-07-29T09:51:43.8097786Z    Compiling reqwest v0.13.4
2026-07-29T09:51:44.7254981Z    Compiling hickory-resolver v0.26.0-beta.4
2026-07-29T09:51:58.4255482Z    Compiling spt-net v0.45.0 (/home/reavus/actions-runner/_work/spt-bs-core/spt-bs-core/crates/spt-net)
2026-07-29T09:52:00.0035637Z    Compiling spt-daemon v0.45.0 (/home/reavus/actions-runner/_work/spt-bs-core/spt-bs-core/crates/spt-daemon)
2026-07-29T09:52:11.3587471Z    Compiling spt v0.45.0 (/home/reavus/actions-runner/_work/spt-bs-core/spt-bs-core/crates/spt)
2026-07-29T09:52:11.3588467Z    Compiling xtask v0.45.0 (/home/reavus/actions-runner/_work/spt-bs-core/spt-bs-core/crates/xtask)
2026-07-29T09:52:20.4486930Z     Finished `test` profile [unoptimized + debuginfo] target(s) in 1m 14s
2026-07-29T09:52:20.4755065Z      Running unittests src/capture_player.rs (target/debug/deps/capture_player-ac96f86427963963)
2026-07-29T09:52:20.4765442Z 
2026-07-29T09:52:20.4765540Z running 2 tests
2026-07-29T09:52:20.4771167Z test tests::parses_a_well_formed_record ... ok
2026-07-29T09:52:20.4771630Z      Running unittests src/console_mode_probe.rs (target/debug/deps/console_mode_probe-4631fcd2c9f71808)
2026-07-29T09:52:20.4772035Z test tests::refuses_a_length_mismatch ... ok
2026-07-29T09:52:20.4772202Z 
2026-07-29T09:52:20.4772408Z test result: ok. 2 passed; 0 failed; 0 ignored; 0 measured; 0 filtered out; finished in 0.00s
2026-07-29T09:52:20.4772684Z 
2026-07-29T09:52:20.4781394Z 
2026-07-29T09:52:20.4781519Z running 0 tests
2026-07-29T09:52:20.4781684Z 
2026-07-29T09:52:20.4781904Z test result: ok. 0 passed; 0 failed; 0 ignored; 0 measured; 0 filtered out; finished in 0.00s
2026-07-29T09:52:20.4782181Z 
2026-07-29T09:52:20.4783354Z      Running unittests src/main.rs (target/debug/deps/mock_session-218862da17d0d1c1)
2026-07-29T09:52:20.4792007Z 
2026-07-29T09:52:20.4792107Z running 0 tests
2026-07-29T09:52:20.4792283Z 
2026-07-29T09:52:20.4792589Z test result: ok. 0 passed; 0 failed; 0 ignored; 0 measured; 0 filtered out; finished in 0.00s
2026-07-29T09:52:20.4793008Z 
2026-07-29T09:52:20.4794047Z      Running unittests src/shell.rs (target/debug/deps/mock_shell-38ccdb0e117a09fa)
2026-07-29T09:52:20.4801711Z 
2026-07-29T09:52:20.4801894Z running 0 tests
2026-07-29T09:52:20.4802144Z 
2026-07-29T09:52:20.4802466Z test result: ok. 0 passed; 0 failed; 0 ignored; 0 measured; 0 filtered out; finished in 0.00s
2026-07-29T09:52:20.4802896Z 
2026-07-29T09:52:20.4803773Z      Running unittests tests/fixtures/gh_fixture.rs (target/debug/deps/gh_fixture-02c17df5813091d3)
2026-07-29T09:52:20.4810774Z 
2026-07-29T09:52:20.4810899Z running 0 tests
2026-07-29T09:52:20.4811166Z 
2026-07-29T09:52:20.4811552Z test result: ok. 0 passed; 0 failed; 0 ignored; 0 measured; 0 filtered out; finished in 0.00s
2026-07-29T09:52:20.4811962Z 
2026-07-29T09:52:20.4812552Z      Running unittests tests/fixtures/git_fixture.rs (target/debug/deps/git_fixture-3699941722a9ce47)
2026-07-29T09:52:20.4820334Z 
2026-07-29T09:52:20.4820521Z running 0 tests
2026-07-29T09:52:20.4870684Z      Running unittests tests/fixtures/post_step_fixture.rs (target/debug/deps/post_step_fixture-c478d99a0f69edcd)
2026-07-29T09:52:20.4871280Z      Running unittests src/main.rs (target/debug/deps/spt-c2028e83f31baa32)
2026-07-29T09:52:20.4871528Z 
2026-07-29T09:52:20.4871738Z test result: ok. 0 passed; 0 failed; 0 ignored; 0 measured; 0 filtered out; finished in 0.00s
2026-07-29T09:52:20.4872001Z 
2026-07-29T09:52:20.4872029Z 
2026-07-29T09:52:20.4872129Z running 0 tests
2026-07-29T09:52:20.4872229Z 
2026-07-29T09:52:20.4872435Z test result: ok. 0 passed; 0 failed; 0 ignored; 0 measured; 0 filtered out; finished in 0.00s
2026-07-29T09:52:20.4872730Z 
2026-07-29T09:52:20.4872754Z 
2026-07-29T09:52:20.4873102Z running 449 tests
2026-07-29T09:52:20.4875533Z test api::auth::tests::mints_distinct_nonempty_tokens ... ok
2026-07-29T09:52:20.5018910Z test api::auth::tests::dead_owner_repin_refused_when_sid_is_a_psyche_custody_sid ... ok
2026-07-29T09:52:20.5043957Z test api::auth::tests::dead_owner_repin_refused_when_sid_owns_another_perch ... ok
2026-07-29T09:52:20.5074059Z test api::auth::tests::dead_owner_repin_still_rescues_a_non_custody_sid ... ok
2026-07-29T09:52:20.5083628Z test api::auth::tests::missing_endpoint_is_no_endpoint ... ok
2026-07-29T09:52:20.5084300Z test api::auth::tests::live_owner_mismatch_still_refuses ... ok
2026-07-29T09:52:20.5090183Z test api::delivery::tests::inject_all_pty_falls_back_to_hook ... ok
2026-07-29T09:52:20.5092707Z test api::delivery::tests::inject_resolution_drops_pty_defaults_hook ... ok
2026-07-29T09:52:20.5095218Z test api::auth::tests::no_proof_is_refused ... ok
2026-07-29T09:52:20.5115022Z test api::auth::tests::pinned_to_dead_sid_mismatched_poll_repins ... ok
2026-07-29T09:52:20.5125463Z test api::auth::tests::session_id_proof_authenticates ... ok
2026-07-29T09:52:20.5134829Z test api::auth::tests::token_auth_path_unchanged ... ok
2026-07-29T09:52:20.5144522Z test api::auth::tests::worker_missing_is_no_endpoint ... ok
2026-07-29T09:52:20.5145171Z test api::auth::tests::token_proof_authenticates ... ok
2026-07-29T09:52:20.5162523Z test api::auth::tests::worker_parent_current_sid_authenticates_after_rotation ... ok
2026-07-29T09:52:20.5179127Z test api::auth::tests::worker_wrong_sid_and_token_only_refused ... ok
2026-07-29T09:52:20.5195405Z test api::auth::tests::worker_stored_sid_authenticates ... ok
2026-07-29T09:52:20.5205709Z test api::auth::tests::wrong_token_and_wrong_session_refused ... ok
2026-07-29T09:52:20.5222187Z test api::delivery::tests::an_undated_state_is_dated_by_a_non_edge_report ... ok
2026-07-29T09:52:20.5228570Z test api::delivery::tests::echo_gate_explicit_toggle ... ok
2026-07-29T09:52:20.5239587Z test api::delivery::tests::idle_busy_transitions_manage_sentinels ... ok
2026-07-29T09:52:20.5242241Z test api::reporting::tests::capability_lists_hostable_types ... ok
2026-07-29T09:52:20.5408845Z test api::delivery::tests::idle_drain_peek_returns_non_deferred_rows_only ... ok
2026-07-29T09:52:20.5419798Z test api::delivery::tests::idle_no_gate_does_not_arm_gate ... ok
2026-07-29T09:52:20.6037183Z test api::delivery::tests::only_a_real_state_edge_stamps_the_transition_instant ... ok
2026-07-29T09:52:20.6037900Z test api::reporting::tests::endpoint_info_attached_node_from_honest_stamps ... ok
2026-07-29T09:52:20.6039287Z test api::reporting::tests::endpoint_info_attached_node_self_attributes_own_node_driver ... ok
2026-07-29T09:52:20.6042260Z test api::reporting::tests::endpoint_info_json_always_carries_an_activity_word ... ok
2026-07-29T09:52:20.6260903Z test api::delivery::tests::poll_drain_holds_deferred_while_resting_and_releases_once_on_wake ... ok
2026-07-29T09:52:20.6264742Z test api::reporting::tests::env_aliases_resolved_from_manifest ... ok
2026-07-29T09:52:20.6516551Z test api::delivery::tests::poll_drain_suppresses_idle_only_which_reaches_the_relay ... ok
2026-07-29T09:52:20.6519658Z test api::reporting::tests::filedrops_are_fixed_named_files ... ok
2026-07-29T09:52:20.6798231Z test api::delivery::tests::poll_drain_validates_notify_copies_against_their_rows ... ok
2026-07-29T09:52:20.6980821Z test api::delivery::tests::poll_drains_non_deferred_by_default ... ok
2026-07-29T09:52:20.7147007Z test api::delivery::tests::poll_only_drains_when_hook_method_present ... ok
2026-07-29T09:52:20.7265797Z test api::reporting::tests::boundary_appends_to_the_session_ledger ... ok
2026-07-29T09:52:20.7541249Z test api::reporting::tests::boundary_missing_perch_refused ... ok
2026-07-29T09:52:20.7546684Z test api::reporting::tests::boundary_injects_deferred_shell_context ... ok
2026-07-29T09:52:20.7644392Z test api::reporting::tests::boundary_rebinds_keeping_anchor ... ok
2026-07-29T09:52:20.7663200Z test api::reporting::tests::boundary_refuses_rotating_onto_a_psyche_custody_sid ... ok
2026-07-29T09:52:20.7942392Z test api::reporting::tests::boundary_resurfaces_undismissed_notifs ... ok
2026-07-29T09:52:20.8000634Z test api::startup::tests::a_dead_binder_pid_proves_nothing_and_never_drops_the_stamp ... ok
2026-07-29T09:52:20.8001578Z test api::startup::tests::a_dead_relays_capability_stamp_is_not_resurrected_by_a_listener_rebind ... ok
2026-07-29T09:52:20.8080083Z test api::reporting::tests::boundary_with_a_fresh_sid_is_unaffected_by_the_squat_guard ... ok
2026-07-29T09:52:20.8087386Z test api::reporting::tests::digest_entry_validates_and_appends_to_digest_log ... ok
2026-07-29T09:52:20.8104853Z test api::reporting::tests::driven_by_reads_daemon_marker ... ok
2026-07-29T09:52:20.8124858Z test api::reporting::tests::endpoint_info_activity_word_tracks_the_idle_sentinel ... ok
2026-07-29T09:52:20.8142214Z test api::reporting::tests::endpoint_info_reports_and_refuses ... ok
2026-07-29T09:52:20.8228693Z test api::reporting::tests::erase_unregisters_regardless_of_liveness ... ok
2026-07-29T09:52:20.8237914Z test api::reporting::tests::hint_once_per_session_one_per_message ... ok
2026-07-29T09:52:20.8247400Z test api::reporting::tests::history_log_appends ... ok
2026-07-29T09:52:20.8248045Z test api::reporting::tests::presence_records_endpoint ... ok
2026-07-29T09:52:20.8409528Z test api::reporting::tests::session_end_erase_reaps_stale_worker_then_proceeds ... ok
2026-07-29T09:52:20.8534128Z test api::reporting::tests::session_end_erase_refused_with_live_children ... ok
2026-07-29T09:52:20.8582204Z test api::reporting::tests::session_end_erase_wipes_childless_perch ... ok
2026-07-29T09:52:20.8582888Z test api::startup::tests::fresh_bind_over_dead_life_needs_both_terminal_and_a_new_session ... ok
2026-07-29T09:52:20.8633899Z test api::reporting::tests::session_end_soft_preserves_state ... ok
2026-07-29T09:52:20.8693720Z test api::reporting::tests::soft_end_preserves_a_live_listeners_address ... ok
2026-07-29T09:52:20.8694390Z test api::startup::tests::listen_never_asserts_hosting_topology_and_bind_still_does ... ok
2026-07-29T09:52:20.8695054Z test api::startup::tests::listen_online_gate_refuses_capability_only_online ... ok
2026-07-29T09:52:20.8695825Z test api::startup::tests::listen_orphan_exit_line_names_self_and_parent ... ok
2026-07-29T09:52:20.8777999Z test api::reporting::tests::soft_end_still_cleans_a_dead_listeners_address ... ok
2026-07-29T09:52:20.9463694Z test api::startup::tests::a_listener_over_a_dead_pty_is_not_offlined_by_the_liveness_reconcile ... ok
2026-07-29T09:52:20.9636600Z test api::startup::tests::bind_assigns_home_and_revive_preserves_it ... ok
2026-07-29T09:52:20.9643812Z test api::startup::tests::parent_watchdog_triggers_exit_on_a_dead_parent_only ... ok
2026-07-29T09:52:20.9731660Z test api::startup::tests::bind_gateway_earns_no_online_stamp ... ok
2026-07-29T09:52:21.2178345Z test api::startup::tests::bind_listen_control_detach_keeps_the_earned_hosting_authority ... ok
2026-07-29T09:52:21.2179319Z test api::startup::tests::read_env_measured_capture_replaces_prior_stamp ... ok
2026-07-29T09:52:21.2282631Z test api::startup::tests::bind_live_agent_over_prior_ready_agent_earns_online_on_controllable_with_preserved_type ... ok
2026-07-29T09:52:21.2481107Z test api::startup::tests::bind_records_cwd_so_picker_can_group_by_project ... ok
2026-07-29T09:52:21.2487988Z test api::startup::tests::bind_refuses_a_session_id_that_squats_a_psyche_custody_sid ... ok
2026-07-29T09:52:21.2597484Z test api::startup::tests::bind_with_type_establishes_a_gateway_endpoint ... ok
2026-07-29T09:52:21.2597983Z test api::startup::tests::seed_fail_eof_gives_actionable_stale_broker_hint ... ok
2026-07-29T09:52:21.2598796Z test api::startup::tests::seed_restorable_spends_dead_seeds_restores_recoverable ... ok
2026-07-29T09:52:21.2616018Z test api::startup::tests::bind_with_unrelated_sid_is_unaffected_by_the_squat_guard ... ok
2026-07-29T09:52:21.2673471Z test api::startup::tests::empty_session_seed_refusal_spends_the_seed_no_restore ... ok
2026-07-29T09:52:21.2733573Z test api::startup::tests::empty_session_seed_refused ... ok
2026-07-29T09:52:21.2923865Z test api::startup::tests::establish_stamps_controllable_by_hosting_mode ... ok
2026-07-29T09:52:21.3086356Z test api::startup::tests::fresh_create_over_a_stopped_life_reads_active_with_no_wake ... ok
2026-07-29T09:52:21.3236369Z test api::startup::tests::fresh_create_with_no_prior_carries_no_rest_state ... ok
2026-07-29T09:52:21.3236928Z test api::startup::tests::the_pid_role_is_stamped_from_the_entry_path ... ok
2026-07-29T09:52:21.3311375Z test api::startup::tests::live_perch_under_other_session_conflicts ... ok
2026-07-29T09:52:21.3322423Z test api::tests::adapter_is_optional ... ok
2026-07-29T09:52:21.3366859Z test api::startup::tests::missing_seed_refused ... ok
2026-07-29T09:52:21.3437589Z test api::startup::tests::no_seed_is_the_fallback_trigger_then_sid_binds ... ok
2026-07-29T09:52:21.3548102Z test api::startup::tests::post_spawn_bind_establishes_perch ... ok
2026-07-29T09:52:21.3625455Z test api::startup::tests::prebind_refusal_restores_the_seed_for_retry ... ok
2026-07-29T09:52:21.3633552Z test api::tests::state_value_is_validated ... ok
2026-07-29T09:52:21.3680106Z test api::tests::surface_parses ... ok
2026-07-29T09:52:21.3737971Z test api::startup::tests::rebind_same_session_ok ... ok
2026-07-29T09:52:21.3908027Z test api::startup::tests::revive_preserves_prior_rest_state_and_dormant_anchor ... ok
2026-07-29T09:52:21.4070969Z test api::startup::tests::revive_without_cwd_preserves_prior_cwd ... ok
2026-07-29T09:52:21.4139466Z test api::startup::tests::seed_bind_records_seed_captured_cwd ... ok
2026-07-29T09:52:21.4152108Z test api::startup::tests::session_id_fallback_binds_live_perch_from_sid ... ok
2026-07-29T09:52:21.4160982Z test api::startup::tests::session_id_fallback_refuses_empty_sid_and_dead_anchor ... ok
2026-07-29T09:52:21.4162786Z test api::startup::tests::session_id_fallback_refuses_a_psyche_custody_sid ... ok
2026-07-29T09:52:21.4169615Z test cli::resume_resolution_tests::resume_never_feeds_a_provisional ... ok
2026-07-29T09:52:21.4170060Z test cli::run_home_tests::order_by_mru_orders_guidance ... ok
2026-07-29T09:52:21.4170893Z test cli::run_home_tests::run_home_resolution_matrix ... ok
2026-07-29T09:52:21.4171904Z test cli::run_on_live_tests::run_on_live_never_duplicates_and_create_conflicts ... ok
2026-07-29T09:52:21.4172589Z test cli::run_target_tests::resolve_run_target_quadrants ... ok
2026-07-29T09:52:21.4218120Z test cli::tests::a_local_hit_never_asks_the_broker ... ok
2026-07-29T09:52:21.4218683Z test cli::tests::a_status_row_reads_held_over_running_and_carries_its_evidence ... ok
2026-07-29T09:52:21.4223523Z test api::startup::tests::stale_seed_refusal_spends_the_seed_no_restore ... ok
2026-07-29T09:52:21.4255985Z test cli::tests::adapter_add_transport_flags_parse ... ok
2026-07-29T09:52:21.4265939Z test cli::tests::access_subcommands_parse ... ok
2026-07-29T09:52:21.4279614Z test api::startup::tests::stale_seed_with_dead_anchor_refused ... ok
2026-07-29T09:52:21.4355516Z test api::startup::tests::successful_bind_consumes_the_seed_exactly_once ... ok
2026-07-29T09:52:21.4425442Z test api::startup::tests::valid_seed_binds_live_perch ... ok
2026-07-29T09:52:21.4426018Z test cli::tests::adapter_name_validation_flags_every_unknown ... ok
2026-07-29T09:52:21.4426847Z test cli::tests::adapter_names_comma_list_parses_and_refuses_empties ... ok
2026-07-29T09:52:21.4430738Z test api::tests::ctx_manifest_override_wins_when_manifest_present ... ok
2026-07-29T09:52:21.4442744Z test api::tests::ctx_manifest_unregistered_no_manifest_is_none_not_fatal ... ok
2026-07-29T09:52:21.4443481Z test api::tests::ctx_manifest_resolves_from_registry_when_manifest_absent ... ok
2026-07-29T09:52:21.4445667Z test cli::tests::adapter_translate_proof_gates_on_commit ... FAILED
2026-07-29T09:52:21.4452979Z test api::tests::load_manifest_resolves_composite_adapter_option ... ok
2026-07-29T09:52:21.4453804Z test cli::tests::adapter_update_install_dir_is_registered_source_dir_not_repo_name ... ok
2026-07-29T09:52:21.4456415Z test cli::tests::adapter_update_notice_absent_when_no_message ... ok
2026-07-29T09:52:21.4459480Z test cli::tests::adapter_update_notice_renders_declared_message_markdown ... ok
2026-07-29T09:52:21.4460192Z test cli::tests::adapter_update_summary_and_exit_aggregate_isolated_failures ... ok
2026-07-29T09:52:21.4474414Z test cli::tests::adapter_translate_proof_parses ... ok
2026-07-29T09:52:21.4481899Z test api::worker::tests::cascade_guard_tracks_live_children ... ok
2026-07-29T09:52:21.4486822Z test cli::tests::adapter_version_parses ... ok
2026-07-29T09:52:21.4487698Z test cli::tests::all_hidden_this_node_suppresses_no_perches_marker ... ok
2026-07-29T09:52:21.4488362Z test cli::tests::already_applied_message_reads_up_to_date_no_restart ... ok
2026-07-29T09:52:21.4489112Z test cli::tests::any_single_evidence_source_is_enough_and_only_nothing_refuses ... ok
2026-07-29T09:52:21.4508370Z test cli::tests::api_adapter_flag_is_group_level_not_post_subcommand ... ok
2026-07-29T09:52:21.4521587Z test api::worker::tests::guard_clears_only_when_all_children_stopped ... ok
2026-07-29T09:52:21.4522366Z test cli::tests::adapter_subcommands_parse ... ok
2026-07-29T09:52:21.4522836Z test cli::tests::applied_message_appends_restart_required_notice ... ok
2026-07-29T09:52:21.4523449Z test cli::tests::applied_message_renders_semver_or_counter_fallback_and_states_applied ... ok
2026-07-29T09:52:21.4526427Z test cli::tests::api_listen_accepts_session_id_flag ... ok
2026-07-29T09:52:21.4540471Z test cli::tests::bare_spt_parses_to_none ... ok
2026-07-29T09:52:21.4540976Z test cli::tests::bare_tty_guard ... ok
2026-07-29T09:52:21.4570835Z test cli::tests::bare_update_parses_composite_flags ... ok
2026-07-29T09:52:21.4571736Z test cli::tests::broker_image_line_reports_without_warning_or_remedy ... ok
2026-07-29T09:52:21.4572442Z test cli::tests::classify_fetch_reject_matrix ... ok
2026-07-29T09:52:21.4573070Z test cli::tests::classify_flat_archive_never_misfires ... ok
2026-07-29T09:52:21.4573692Z test cli::tests::classify_multiplatform_captures_only_known_triples ... ok
2026-07-29T09:52:21.4574294Z test cli::tests::cli_send_stamps_cli_at_node_origin ... ok
2026-07-29T09:52:21.4574770Z test cli::tests::composite_plans_core_first_and_core_only_skips_adapters ... ok
2026-07-29T09:52:21.4575294Z test cli::tests::connection_lines_net_less_hides_stale_heartbeat ... ok
2026-07-29T09:52:21.4575865Z test cli::tests::coordinator_image_line_is_the_only_stale_warning ... ok
2026-07-29T09:52:21.4577928Z test cli::tests::create_existing_name_is_usage_error ... ok
2026-07-29T09:52:21.4579936Z test cli::tests::create_new_existing_name_is_usage_error ... ok
2026-07-29T09:52:21.4675616Z test cli::tests::create_new_mints_shows_and_requests_save ... ok
2026-07-29T09:52:21.4677820Z test cli::tests::create_not_elevated_refuses_without_saving ... ok
2026-07-29T09:52:21.4780229Z test cli::tests::create_prints_joining_material_when_elevated ... ok
2026-07-29T09:52:21.4780840Z test cli::tests::cross_node_after_filters_a_sealed_turn_exactly_like_the_local_path ... ok
2026-07-29T09:52:21.4781406Z test cli::tests::daemon_offline_hint_only_when_down ... ok
2026-07-29T09:52:21.4793318Z test api::worker::tests::worker_poll_drains_spool ... ok
2026-07-29T09:52:21.4794754Z test cli::tests::daemon_refresh_verb_parses ... ok
2026-07-29T09:52:21.4795419Z test cli::tests::daemonless_apply_message_points_at_finish_or_start ... ok
2026-07-29T09:52:21.4795914Z test cli::tests::deferred_elevation_gate_matrix ... ok
2026-07-29T09:52:21.4808263Z test cli::tests::digest_cursor_flags_parse ... ok
2026-07-29T09:52:21.4818217Z test cli::tests::digest_flag_defaults ... ok
2026-07-29T09:52:21.4819185Z test cli::tests::digest_human_path_keeps_the_stderr_trailer ... ok
2026-07-29T09:52:21.4821180Z test cli::tests::digest_json_carries_version_and_leaves_stderr_clean ... ok
2026-07-29T09:52:21.4822342Z test cli::tests::digest_json_predates_path_still_carries_version ... ok
2026-07-29T09:52:21.4822918Z test cli::tests::empty_store_no_flag_guides_to_pair_or_create ... ok
2026-07-29T09:52:21.4850913Z test cli::tests::daemon_subcommands_parse ... ok
2026-07-29T09:52:21.4875281Z test cli::tests::endpoint_role_parses ... ok
2026-07-29T09:52:21.4875800Z test cli::tests::endpoint_row_json_endpoint_type_is_additive ... ok
2026-07-29T09:52:21.4966316Z test cli::tests::apply_release_crc_swap_only_swaps_changed ... ok
2026-07-29T09:52:21.4978856Z test api::worker::tests::worker_poll_holds_deferred_while_resting ... ok
2026-07-29T09:52:21.4979568Z test cli::tests::escalation_choice_parses_fail_closed ... ok
2026-07-29T09:52:21.5016677Z test api::worker::tests::worker_start_mints_id_stores_parent_sid_and_metadata ... ok
2026-07-29T09:52:21.5040601Z test api::worker::tests::worker_start_nests_under_parent ... ok
2026-07-29T09:52:21.5063676Z test cli::tests::every_read_status_command_emits_valid_json ... ok
2026-07-29T09:52:21.5064376Z test cli::tests::endpoint_subcommands_parse ... ok
2026-07-29T09:52:21.5065187Z test cli::tests::fetch_reject_action_apply_decision ... ok
2026-07-29T09:52:21.5065969Z test cli::tests::filter_after_excludes_at_or_below_cursor ... ok
2026-07-29T09:52:21.5067214Z test cli::tests::filter_after_predates_window_returns_full ... ok
2026-07-29T09:52:21.5068031Z test cli::tests::finish_message_states_fully_live_no_manual_restart ... ok
2026-07-29T09:52:21.5073531Z test api::worker::tests::worker_start_registration_sid_falls_back_to_presented ... ok
2026-07-29T09:52:21.5074347Z test cli::tests::gh_download_command_no_tag_omits_tag ... ok
2026-07-29T09:52:21.5075146Z test cli::tests::gh_download_command_with_tag_shape ... ok
2026-07-29T09:52:21.5075880Z test cli::tests::gh_failure_classes_render_os_correct_hints ... ok
2026-07-29T09:52:21.5076348Z test cli::tests::gh_release_version_compare_decision ... ok
2026-07-29T09:52:21.5076658Z test cli::tests::gh_version_command_shape ... ok
2026-07-29T09:52:21.5115490Z test cli::tests::grant_subcommands_parse ... ok
2026-07-29T09:52:21.5159134Z test cli::tests::help_groups_cover_every_command ... ok
2026-07-29T09:52:21.5245411Z test cli::tests::hot_path_flat_and_moved_verbs_gone ... ok
2026-07-29T09:52:21.5245869Z test cli::tests::extract_legacy_flat_stays_flat ... ok
2026-07-29T09:52:21.5251525Z test cli::tests::install_place_is_idempotent_and_path_block_detected ... ok
2026-07-29T09:52:21.5252114Z test cli::tests::install_platform_check_gates_stamp_and_host_arch ... ok
2026-07-29T09:52:21.5253397Z test cli::tests::instance_rows_palette_and_align ... ok
2026-07-29T09:52:21.5254669Z test cli::tests::instance_rows_project_column ... ok
2026-07-29T09:52:21.5268726Z test cli::tests::extract_multiplatform_missing_my_triple_is_typed_rejection ... ok
2026-07-29T09:52:21.5269684Z test cli::tests::join_gate_refuses_without_confirmed_elevation ... ok
2026-07-29T09:52:21.5271368Z test cli::tests::json_activity_key_is_local_only_and_skips_when_unknown ... ok
2026-07-29T09:52:21.5273459Z test cli::tests::invalid_usage_errors ... ok
2026-07-29T09:52:21.5273831Z test cli::tests::json_activity_words_come_from_the_shared_vocabulary_source ... ok
2026-07-29T09:52:21.5274908Z test cli::tests::how_to_topics_cover_ready_and_send ... ok
2026-07-29T09:52:21.5275545Z test cli::tests::json_project_field_skip_if_none ... ok
2026-07-29T09:52:21.5276901Z test cli::tests::node_group_discards_self_and_skips_empty ... ok
2026-07-29T09:52:21.5277781Z test cli::tests::node_group_freshest_epoch_wins_and_unions_subnets ... ok
2026-07-29T09:52:21.5278704Z test cli::tests::node_group_same_id_two_nodes_two_groups ... ok
2026-07-29T09:52:21.5279982Z test cli::tests::node_grouped_render_structure_and_palette ... ok
2026-07-29T09:52:21.5281114Z test cli::tests::node_level_label_names_an_endpointless_peer ... ok
2026-07-29T09:52:21.5281886Z test cli::tests::node_rows_disambiguate_only_on_label_collision ... ok
2026-07-29T09:52:21.5283248Z test cli::tests::node_status_rows_denominator_counts_routable_only ... ok
2026-07-29T09:52:21.5284391Z test cli::tests::node_status_rows_settle_cheap_signals_probe_only_stale ... ok
2026-07-29T09:52:21.5286941Z test cli::tests::not_elevated_refuses_without_leaking_code_or_saving ... ok
2026-07-29T09:52:21.5290099Z test cli::tests::notify_subnet_resolution_home_default ... ok
2026-07-29T09:52:21.5291356Z test cli::tests::extract_multiplatform_places_shared_root_and_flattens_my_triple ... ok
2026-07-29T09:52:21.5292145Z test cli::tests::origin_asset_urls_latest_and_tag ... ok
2026-07-29T09:52:21.5337078Z test cli::tests::notify_surface_parses ... ok
2026-07-29T09:52:21.5353070Z test cli::tests::pair_namespace_is_gone ... ok
2026-07-29T09:52:21.5354479Z test cli::tests::peer_health_line_names_the_stage_and_stays_silent_when_idle ... ok
2026-07-29T09:52:21.5355059Z test cli::tests::poll_until_ready_fastpath_timeout_and_later_success ... ok
2026-07-29T09:52:21.5355549Z test cli::tests::post_step_notice_arbitration ... ok
2026-07-29T09:52:21.5372846Z test cli::tests::multi_subnet_refuses_without_flag_then_resolves_with_it ... ok
2026-07-29T09:52:21.5497073Z test cli::tests::adapter_digest_proof_fills_session_id_key ... ok
2026-07-29T09:52:21.5930219Z test cli::tests::adapter_digest_proof_gates_on_drops ... ok
2026-07-29T09:52:21.5931011Z test cli::tests::project_index_line_states_health_not_presence ... ok
2026-07-29T09:52:21.5931558Z test cli::tests::prune_candidates_resolve_never_guess ... ok
2026-07-29T09:52:21.5961913Z test cli::tests::adapter_has_live_endpoint_detects_matching_live_perch ... ok
2026-07-29T09:52:21.5992827Z test cli::tests::adapter_has_live_endpoint_false_for_other_or_dead ... ok
2026-07-29T09:52:21.6020082Z test cli::tests::adapter_profile_verbs_local_only ... ok
2026-07-29T09:52:21.6034172Z test cli::tests::registered_github_home_detects_active_collision ... ok
2026-07-29T09:52:21.6049429Z test cli::tests::adapter_string_verbs ... ok
2026-07-29T09:52:21.6050345Z test cli::tests::remote_cell_project_ref_from_gossiped_recent_projects ... ok
2026-07-29T09:52:21.6060537Z test cli::tests::adapter_use_sets_and_clears_pointer ... ok
2026-07-29T09:52:21.6060962Z test cli::tests::resolve_transport_auto_follows_probe ... ok
2026-07-29T09:52:21.6061568Z test cli::tests::resolve_transport_explicit_never_probes ... ok
2026-07-29T09:52:21.6062276Z test cli::tests::rest_filter_hides_suspended_shows_all_and_corrupt_always ... ok
2026-07-29T09:52:21.6062808Z test cli::tests::rest_filter_status_first_ordering ... ok
2026-07-29T09:52:21.6063738Z test cli::tests::rest_filter_total_disclosure_and_corrupt_annotation ... ok
2026-07-29T09:52:21.6064229Z test cli::tests::restart_plans_lethal_leg_last ... ok
2026-07-29T09:52:21.6068254Z test cli::tests::adapter_version_surfaces_declared_adapter_version ... ok
2026-07-29T09:52:21.6078423Z test cli::tests::ring_timeout_defaults ... ok
2026-07-29T09:52:21.6079305Z test cli::tests::self_pin_annotates_psyche_host_failure ... ok
2026-07-29T09:52:21.6080220Z test cli::tests::self_pin_annotates_translation_fault ... ok
2026-07-29T09:52:21.6081581Z test cli::tests::self_pin_includes_description_when_present ... ok
2026-07-29T09:52:21.6087874Z test cli::tests::apply_user_msg_gate_local_origination ... ok
2026-07-29T09:52:21.6103170Z test cli::tests::send_user_msg_flag_parses ... ok
2026-07-29T09:52:21.6104148Z test cli::tests::send_reply_to_flag_is_removed_and_target_required ... ok
2026-07-29T09:52:21.6456010Z test cli::tests::release_archive_extracts_to_a_registrable_root ... ok
2026-07-29T09:52:21.6571525Z test cli::tests::run_bounded_yields_value_or_timeout_default ... ok
2026-07-29T09:52:21.7002429Z test cli::tests::probe_all_timeout_settles_false_without_stalling_batch ... ok
2026-07-29T09:52:21.7380748Z test cli::tests::probe_all_runs_concurrently_in_input_order ... ok
2026-07-29T09:52:21.7872382Z test cli::tests::endpoint_role_overwrite_is_the_sole_writer ... ok
2026-07-29T09:52:21.7959820Z test cli::tests::endpoint_stop_marks_offline ... ok
2026-07-29T09:52:21.8038358Z test cli::tests::shell_subcommands_parse ... ok
2026-07-29T09:52:21.8138292Z test cli::tests::show_code_prints_reprovisioning_material ... ok
2026-07-29T09:52:22.0375589Z test cli::tests::probe_all_cap_batches_into_windows ... ok
2026-07-29T09:52:22.2515141Z test cli::tests::json_payload_rides_as_attr_alongside_body ... ok
2026-07-29T09:52:22.2537080Z test cli::tests::fork_forks_homes_and_deletes_exactly_the_source ... ok
2026-07-29T09:52:22.2640773Z test cli::tests::single_subnet_auto_selects_and_code_matches_seed ... ok
2026-07-29T09:52:37.3543549Z test cli::tests::owner_shutdown_gated_by_can_shutdown_grant ... ok
2026-07-29T09:52:37.3755615Z test cli::tests::stage_then_swap_failed_fetch_preserves_install ... ok
2026-07-29T09:52:37.4145139Z test cli::tests::purge_force_asks_before_it_tears_anything_down ... ok
2026-07-29T09:52:37.4155881Z test cli::tests::purge_offline_gate_and_self_guard ... ok
2026-07-29T09:52:37.4156543Z test cli::tests::stall_evict_line_surfaces_only_a_real_tally ... ok
2026-07-29T09:52:37.4157512Z test cli::tests::stop_guard_refuses_live_sessions_without_force ... ok
2026-07-29T09:52:37.4170076Z test cli::tests::staged_floor_admits_when_core_meets_floor ... ok
2026-07-29T09:52:37.4242711Z test cli::tests::subcommands_parse ... ok
2026-07-29T09:52:37.4247113Z test cli::tests::subnet_status_renders_rows_and_hints_never_secrets ... ok
2026-07-29T09:52:37.4247938Z test cli::tests::subnets_joined_banner_renders_rows_and_divider ... ok
2026-07-29T09:52:37.4248619Z test cli::tests::subprocess_detail_prefers_stderr_then_stdout ... ok
2026-07-29T09:52:37.4293984Z test cli::tests::subnet_arg_shapes_parse ... ok
2026-07-29T09:52:37.4295037Z test cli::tests::this_node_group_merges_roster_with_unbound_truth ... ok
2026-07-29T09:52:37.4295839Z test cli::tests::trust_mutation_gate_refuses_without_confirmed_elevation ... ok
2026-07-29T09:52:37.4298264Z test cli::tests::unknown_elevation_falls_back ... ok
2026-07-29T09:52:37.4300420Z test cli::tests::unknown_named_subnet_is_usage_error ... ok
2026-07-29T09:52:37.4317466Z test cli::tests::update_adapters_verb_parses_with_optional_names ... ok
2026-07-29T09:52:37.4332994Z test cli::tests::update_fetch_apply_flag_parses ... ok
2026-07-29T09:52:37.4336878Z test cli::tests::the_evidence_census_reads_each_local_source ... ok
2026-07-29T09:52:37.4337635Z test elevation::tests::already_elevated_short_circuits_on_every_os ... ok
2026-07-29T09:52:37.4338477Z test elevation::tests::current_returns_a_determinate_level_on_supported_platforms ... ok
2026-07-29T09:52:37.4339473Z test elevation::tests::fallback_message_names_authenticator_app_and_subnet ... ok
2026-07-29T09:52:37.4340254Z test elevation::tests::gate_shows_only_when_confirmed_elevated ... ok
2026-07-29T09:52:37.4340866Z test elevation::tests::launcher_argv_is_absolute_exe_plus_verbatim_args ... ok
2026-07-29T09:52:37.4341387Z test elevation::tests::launchers_never_shell_interpolate_a_crafted_arg ... ok
2026-07-29T09:52:37.4341867Z test elevation::tests::print_hint_floor_uses_absolute_path_each_os ... ok
2026-07-29T09:52:37.4342378Z test elevation::tests::unix_path_order_tty_then_pkexec_then_terminal_then_hint ... ok
2026-07-29T09:52:37.4342894Z test elevation::tests::windows_uac_only_interactive_other_always_prints ... ok
2026-07-29T09:52:37.4343426Z test helpfmt::tests::atx_header_at_line_start_strips_and_bolds ... ok
2026-07-29T09:52:37.4343835Z test helpfmt::tests::bold_styles_with_color_and_strips_without ... ok
2026-07-29T09:52:37.4344943Z test helpfmt::tests::code_styles_with_color_and_strips_without ... ok
2026-07-29T09:52:37.4345423Z test helpfmt::tests::color_enabled_truth_table ... ok
2026-07-29T09:52:37.4345869Z test helpfmt::tests::dual_contract_token_survives_strip_mode ... ok
2026-07-29T09:52:37.4346622Z test cli::tests::whoami_parses_as_the_identity_verb ... ok
2026-07-29T09:52:37.4347105Z test helpfmt::tests::dual_contract_token_unstyled_while_prose_styles_on_color ... ok
2026-07-29T09:52:37.4347666Z test helpfmt::tests::empty_and_unmatched_markers_stay_literal ... ok
2026-07-29T09:52:37.4348096Z test helpfmt::tests::link_becomes_its_text ... ok
2026-07-29T09:52:37.4348503Z test helpfmt::tests::marker_never_spans_a_hard_break ... ok
2026-07-29T09:52:37.4348855Z test helpfmt::tests::marker_spans_a_clap_soft_wrap ... ok
2026-07-29T09:52:37.4349337Z test helpfmt::tests::multibyte_text_survives ... ok
2026-07-29T09:52:37.4350005Z test helpfmt::tests::nested_code_inside_bold_styles_both ... ok
2026-07-29T09:52:37.4350372Z test helpfmt::tests::plain_text_is_unchanged ... ok
2026-07-29T09:52:37.4350952Z test helpfmt::tests::preexisting_ansi_is_passed_through_untouched ... ok
2026-07-29T09:52:37.4351412Z test helpfmt::tests::resolve_console_color_strips_when_vt_unavailable ... ok
2026-07-29T09:52:37.4351831Z test picker::data::tests::disambiguate_project_ids_cases ... ok
2026-07-29T09:52:37.4352223Z test picker::data::tests::driven_by_display_renders_name_not_hex ... ok
2026-07-29T09:52:37.4560725Z test cli::tests::staged_floor_refuses_above_floor_and_leaves_dest_untouched ... ok
2026-07-29T09:52:37.7702004Z test cli::tests::resolve_proof_target_override_reads_on_disk ... ok
2026-07-29T09:52:37.7702599Z test picker::data::tests::indexed_projection_full_w2shaped_and_absent_legs ... ok
2026-07-29T09:52:37.7703311Z test picker::data::tests::non_drivable_predicate_covers_worker_and_psyche ... ok
2026-07-29T09:52:37.7711312Z test cli::tests::purge_removes_every_record ... ok
2026-07-29T09:52:37.8186500Z test cli::tests::shell_channels_relay_sensory_and_text_file ... ok
2026-07-29T09:52:37.8187776Z test picker::data::tests::project_refs_from_sessions_excludes_owlery_and_dedups_newest_first ... ok
2026-07-29T09:52:37.8189149Z test picker::data::tests::project_refs_from_unions_fresh_origin_and_store_branches ... ok
2026-07-29T09:52:37.8190204Z test picker::data::tests::reconcile_overrides_subnet_with_local_roster ... ok
2026-07-29T09:52:37.8231400Z test cli::tests::shell_owner_exclusivity_negatives ... ok
2026-07-29T09:52:37.8357196Z test cli::tests::shell_relink_relaunches_offline_instances_only ... ok
2026-07-29T09:52:37.8358211Z test picker::data::tests::resume_rows_derive_per_row_project_and_drop_owlery_sessions ... ok
2026-07-29T09:52:37.8620937Z test cli::tests::shell_spawn_approval_floor_gates ... ok
2026-07-29T09:52:37.8621801Z test picker::data::tests::row_status_drives_unbound_display ... ok
2026-07-29T09:52:37.8719527Z test cli::tests::shell_spawn_cap_and_over_cap_gates ... ok
2026-07-29T09:52:37.8720016Z test picker::model::tests::adapter_tree_nests_profiles ... ok
2026-07-29T09:52:37.8720426Z test picker::model::tests::back_unwinds ... ok
2026-07-29T09:52:37.8721145Z test picker::model::tests::build_project_choices_head_here_rest ... ok
2026-07-29T09:52:37.8721656Z test picker::model::tests::category_labels_render_display_forms ... ok
2026-07-29T09:52:37.8722176Z test picker::model::tests::category_ring_wraps ... ok
2026-07-29T09:52:37.8722992Z test picker::model::tests::change_adapter_picks_and_returns_to_confirm ... ok
2026-07-29T09:52:37.8723641Z test picker::model::tests::choose_project_outcome_bakes_cwd_and_diverts ... ok
2026-07-29T09:52:37.8724332Z test picker::model::tests::confirm_local_offline_unchanged_by_wake_split ... ok
2026-07-29T09:52:37.8724990Z test picker::model::tests::confirm_options_remote_suspended_is_wake_not_start ... ok
2026-07-29T09:52:37.8725576Z test picker::model::tests::confirm_options_status_dependent ... ok
2026-07-29T09:52:37.8726067Z test picker::model::tests::confirm_terminal_routes ... ok
2026-07-29T09:52:37.8726563Z test picker::model::tests::confirm_terminal_wake_carries_raw_node ... ok
2026-07-29T09:52:37.8727135Z test picker::model::tests::create_new_multisubnet_inserts_home_layer ... ok
2026-07-29T09:52:37.8727584Z test picker::model::tests::create_outcome_bakes_run ... ok
2026-07-29T09:52:37.8728030Z test picker::model::tests::cursor_clamps ... ok
2026-07-29T09:52:37.8728571Z test picker::model::tests::display_mapping_matrix ... ok
2026-07-29T09:52:37.8729143Z test picker::model::tests::display_status_four_state_type_gated ... ok
2026-07-29T09:52:37.8729974Z test picker::model::tests::display_status_unbound_is_hollow_and_attachable ... ok
2026-07-29T09:52:37.8730547Z test picker::model::tests::empty_scope_opens_create ... ok
2026-07-29T09:52:37.8731062Z test picker::model::tests::ep_display_glyph_and_square_palette ... ok
2026-07-29T09:52:37.8731572Z test picker::model::tests::esc_backs_out_of_home_layer ... ok
2026-07-29T09:52:37.8733383Z test picker::model::tests::filter_narrows ... ok
2026-07-29T09:52:37.8733934Z test picker::model::tests::from_resource_row_maps_gossiped_adapter_projects_controlled ... ok
2026-07-29T09:52:37.8734740Z test picker::model::tests::home_selection_bakes_into_run_subnet ... ok
2026-07-29T09:52:37.8735197Z test picker::model::tests::kind_routes ... ok
2026-07-29T09:52:37.8735718Z test picker::model::tests::launch_keys_live_only_on_launch_capable_highlights ... ok
2026-07-29T09:52:37.8736274Z test picker::model::tests::prefill_jumps_to_create ... ok
2026-07-29T09:52:37.8736894Z test picker::model::tests::project_filter_keys_on_slug_while_tab_renders_display ... ok
2026-07-29T09:52:37.8737480Z test picker::model::tests::purge_confirm_yields_outcome_and_backs_out ... ok
2026-07-29T09:52:37.8737892Z test picker::model::tests::purge_shortcut_gates_to_offline_local ... ok
2026-07-29T09:52:37.8738319Z test picker::model::tests::reenter_create_keeps_or_clears_id ... ok
2026-07-29T09:52:37.8738884Z test picker::model::tests::remove_endpoint_drops_row_and_clamps_cursor ... ok
2026-07-29T09:52:37.8739571Z test picker::model::tests::resume_outcome_adapter_follows_recorded_row ... ok
2026-07-29T09:52:37.8740120Z test picker::model::tests::resume_outcome_bakes_session ... ok
2026-07-29T09:52:37.8740891Z test picker::model::tests::resume_title_render ... ok
2026-07-29T09:52:37.8741458Z test picker::model::tests::should_offer_project_choice_fire_conditions ... ok
2026-07-29T09:52:37.8741984Z test picker::model::tests::single_subnet_skips_home_layer ... ok
2026-07-29T09:52:37.8742510Z test picker::model::tests::suspended_is_distinct_from_offline ... ok
2026-07-29T09:52:37.8743016Z test picker::model::tests::visible_partitions_and_sorts ... ok
2026-07-29T09:52:37.8743962Z test picker::shortcut::tests::bakes_create_attach_by_default ... ok
2026-07-29T09:52:37.8744614Z test picker::shortcut::tests::bakes_resume_and_action ... ok
2026-07-29T09:52:37.8745428Z test picker::shortcut::tests::basename_is_parameterized ... ok
2026-07-29T09:52:37.8746053Z test picker::shortcut::tests::sentinel_detection ... ok
2026-07-29T09:52:37.8750193Z test picker::shortcut::tests::write_create_update_refuse ... ok
2026-07-29T09:52:37.8750722Z test picker::tests::backspace_backs_out_screens_like_esc ... ok
2026-07-29T09:52:37.8751390Z test picker::tests::backspace_stays_char_delete_in_text_contexts ... ok
2026-07-29T09:52:37.8751917Z test picker::tests::purge_outcomes_convert_to_flash_lines ... ok
2026-07-29T09:52:37.8815345Z test picker::tests::purge_transition_reconstructs_the_complete_screen_after_external_mutation ... ok
2026-07-29T09:52:37.8854252Z test picker::view::tests::adapter_tree_buffer ... ok
2026-07-29T09:52:37.8878558Z test picker::view::tests::change_adapter_screen_renders_tree_and_apply_legend ... ok
2026-07-29T09:52:37.8906620Z test picker::view::tests::choose_project_buffer_keeps_confirm_panel ... ok
2026-07-29T09:52:37.8940552Z test picker::view::tests::confirm_buffer_options ... ok
2026-07-29T09:52:37.8969709Z test picker::view::tests::confirm_fork_and_shortcut_labels_are_dir_relative ... ok
2026-07-29T09:52:37.9000826Z test picker::view::tests::confirm_panel_history_renders_display_not_slug ... ok
2026-07-29T09:52:37.9029096Z test picker::view::tests::create_home_lists_subnets ... ok
2026-07-29T09:52:37.9079552Z test picker::view::tests::footer_hints_h_s_only_when_launch_keys_live ... ok
2026-07-29T09:52:37.9096889Z test picker::view::tests::kind_buffer ... ok
2026-07-29T09:52:37.9132873Z test picker::view::tests::pick_buffer_has_squares_and_description ... ok
2026-07-29T09:52:37.9164958Z test picker::view::tests::pick_empty_category_hint ... ok
2026-07-29T09:52:37.9359758Z test picker::view::tests::pick_status_line_four_state ... ok
2026-07-29T09:52:37.9393962Z test picker::view::tests::resume_buffer_keeps_confirm_panel ... ok
2026-07-29T09:52:37.9425876Z test picker::view::tests::resume_buffer_lists_sessions ... ok
2026-07-29T09:52:47.9419711Z test cli::tests::shell_spawn_gates_on_the_registered_set ... ok
2026-07-29T09:52:47.9420779Z test rc::tests::attach_gate_routes_on_session_truth_not_the_row ... ok
2026-07-29T09:52:47.9454016Z test cli::tests::shell_spawn_profiled_option_resolves_and_shares_cap ... ok
2026-07-29T09:52:47.9574403Z test cli::tests::shutdown_and_stop_share_the_postcondition_and_differ_only_in_ceremony ... ok
2026-07-29T09:52:47.9575041Z test rc::tests::broker_host_child ... ok
2026-07-29T09:52:47.9575513Z test rc::tests::canonical_wire_id_strips_qualifiers_to_the_bare_id ... ok
2026-07-29T09:52:47.9576128Z test rc::tests::classify_read_err_eof_is_graceful_not_fatal ... ok
2026-07-29T09:52:47.9576873Z test rc::tests::detach_keybind_semantics ... ok
2026-07-29T09:52:47.9577488Z test rc::tests::detach_prefix_spans_chunks ... ok
2026-07-29T09:52:47.9578380Z test rc::tests::display_guard_postlude_exactly_once_and_inactive_silent ... ok
2026-07-29T09:52:47.9579019Z test rc::tests::driver_phrase_names_own_node_plainly_but_remote_verbatim ... ok
2026-07-29T09:52:47.9682240Z test cli::tests::shutdown_on_a_broker_hosted_endpoint_stamps_after_the_reap ... ok
2026-07-29T09:52:47.9682742Z test rc::tests::first_event_stall_decision ... ok
2026-07-29T09:52:47.9683362Z test rc::tests::give_up_copy_names_daemon_down_vs_generic ... ok
2026-07-29T09:52:47.9683947Z test rc::tests::harness_only_row_matches_online_seatless_live_agents_only ... ok
2026-07-29T09:52:47.9684655Z test rc::tests::identity_line_format ... ok
2026-07-29T09:52:47.9685527Z test rc::tests::mouse_mode_decset_scan_survives_split_across_chunks ... ok
2026-07-29T09:52:47.9686219Z test rc::tests::mouse_mode_decset_scan_tracks_enable_and_sgr ... ok
2026-07-29T09:52:47.9689348Z test rc::tests::op_minter_distinct_and_monotonic ... ok
2026-07-29T09:52:47.9690031Z test rc::tests::pre_broker_busy_guidance_fires_for_any_driver_not_just_remote ... ok
2026-07-29T09:52:47.9691212Z test rc::tests::public_attach_failure_maps_deadline_class_only ... ok
2026-07-29T09:52:47.9691856Z test rc::tests::pump_status_emit_sequence_over_write_sink ... ok
2026-07-29T09:52:47.9710459Z test cli::tests::shutdown_on_a_harness_hosted_endpoint_claims_no_process ... ok
2026-07-29T09:52:47.9711003Z test rc::tests::reassert_scanner_survives_split_across_chunks ... ok
2026-07-29T09:52:47.9711709Z test rc::tests::reassert_scanner_triggers_only_on_region_destroyers ... ok
2026-07-29T09:52:47.9712408Z test rc::tests::reconnect_banner_clears_and_centers ... ok
2026-07-29T09:52:47.9713081Z test rc::tests::reconnect_banner_shows_the_countdown ... ok
2026-07-29T09:52:47.9713793Z test rc::tests::reconnect_class_only_severed_transport_redrives ... ok
2026-07-29T09:52:47.9714503Z test rc::tests::reconnect_remaining_secs_counts_down_ceil ... ok
2026-07-29T09:52:47.9715124Z test rc::tests::reconnect_window_expiry_decision ... ok
2026-07-29T09:52:47.9715657Z test rc::tests::serve_eof_severed_vs_refused ... ok
2026-07-29T09:52:47.9716238Z test rc::tests::status_assert_reserves_row1_then_repaints ... ok
2026-07-29T09:52:47.9716897Z test rc::tests::status_repaint_exact_bytes_and_right_align ... ok
2026-07-29T09:52:47.9717389Z test rc::tests::status_restore_exact_bytes ... ok
2026-07-29T09:52:47.9717847Z test rc::tests::status_row_marker_is_disabled_by_flag ... ok
2026-07-29T09:52:47.9718353Z test rc::tests::status_update_size_repoints_geometry ... ok
2026-07-29T09:52:47.9719198Z test rc::tests::teardown_matrix_postlude_precedes_prose_across_every_final_class ... ok
2026-07-29T09:52:47.9855387Z test cli::tests::spt_hosted_no_relay_detection ... ok
2026-07-29T09:52:47.9929795Z test picker::data::tests::gather_endpoints_projects_from_seeded_index_with_zero_git ... ok
2026-07-29T09:52:47.9992768Z test picker::data::tests::gather_renders_live_unbound ... ok
2026-07-29T09:52:48.0315844Z test picker::data::tests::home_subnet_options_is_mru_ordered ... ok
2026-07-29T09:52:48.0327817Z test picker::data::tests::own_node_tab_label_falls_back_to_keyprefix ... ok
2026-07-29T09:52:48.0408218Z test picker::data::tests::picker_excludes_flat_worker_and_psyche ... ok
2026-07-29T09:52:48.0421986Z test picker::data::tests::remote_picker_renders_suspended_dead_perch_offline ... ok
2026-07-29T09:52:48.0422607Z test roster::tests::match_self_by_ancestry_disambiguates_and_none ... ok
2026-07-29T09:52:48.0437670Z test picker::data::tests::remote_rows_render_full_palette_parity ... ok
2026-07-29T09:52:48.0442505Z test picker::data::tests::resume_rows_title_from_index_cwd_map_with_pure_fallback ... ok
2026-07-29T09:52:48.0443144Z test teardown::tests::an_unconfirmed_row_over_a_dead_root_is_stale_not_a_survivor ... ok
2026-07-29T09:52:48.0458428Z test picker::data::tests::shared_machine_is_one_group_with_unioned_subnets ... ok
2026-07-29T09:52:48.0459143Z test teardown::tests::timeout_refuses_the_stamp_and_names_the_survivor ... ok
2026-07-29T09:52:48.0459735Z test teardown::tests::topology_gate_is_controllable_true_only ... ok
2026-07-29T09:52:48.0460403Z test tests::broken_pipe_panic_classifier ... ok
2026-07-29T09:52:48.0461591Z test wansend::tests::bare_id_resolves_across_remote_snapshot ... ok
2026-07-29T09:52:48.0462071Z test wansend::tests::classify_wan_reply_only_delivers_on_positive_outcomes ... ok
2026-07-29T09:52:48.0466572Z test wansend::tests::load_snapshots_degrades_on_junk ... ok
2026-07-29T09:52:48.0468205Z test wansend::tests::refusals_render_copy_paste_targets ... ok
2026-07-29T09:52:48.0591425Z test teardown::tests::liveness_proof_needs_a_real_snapshot_and_finds_this_process ... ok
2026-07-29T09:52:48.0592012Z test teardown::tests::a_zombie_root_is_provably_gone_not_a_survivor ... ok
2026-07-29T09:52:48.0661532Z test rc::tests::attach_against_stopped_daemon_never_spawns_and_exits_loud ... ok
2026-07-29T09:52:48.0678889Z test rc::tests::attach_offline_endpoint_short_circuits_clean ... ok
2026-07-29T09:52:48.0766057Z 
2026-07-29T09:52:48.0766409Z running 1 test
2026-07-29T09:52:48.1052257Z NTP_TOTP_UNCORRECTED: all NTP servers unreachable — ceremony clock = raw system clock
2026-07-29T09:52:48.1239946Z CONN_LIFECYCLE: conn=1 role=brain wall_ms=1785318768123 mono_ms=0 event=transport-close poisoned=false timed_out=false [REQ-CONN-POISON-ATTRIBUTION]
2026-07-29T09:52:48.1241067Z CONN_LIFECYCLE: conn=3 role=brain wall_ms=1785318768123 mono_ms=0 event=write-start [REQ-CONN-POISON-ATTRIBUTION]
2026-07-29T09:52:48.1255867Z CONN_LIFECYCLE: conn=2 role=brain controller session=1 endpoint=reheal by=local wall_ms=1785318768125 mono_ms=1 event=controller-attach session=1 from_seq=0 [REQ-CONN-POISON-ATTRIBUTION]
2026-07-29T09:52:48.1260455Z CONN_LIFECYCLE: conn=2 role=brain controller session=1 endpoint=reheal by=local wall_ms=1785318768125 mono_ms=2 event=write-start [REQ-CONN-POISON-ATTRIBUTION]
2026-07-29T09:52:48.1266512Z CONN_LIFECYCLE: conn=4 role=brain wall_ms=1785318768126 mono_ms=2 event=write-start [REQ-CONN-POISON-ATTRIBUTION]
2026-07-29T09:52:48.1285834Z CONN_LIFECYCLE: conn=4 role=brain stream-subscriber stream=2 wall_ms=1785318768128 mono_ms=4 event=stream-sub-attach stream=2 from_seq=0 [REQ-CONN-POISON-ATTRIBUTION]
2026-07-29T09:52:48.1752911Z CONN_LIFECYCLE: conn=5 role=brain wall_ms=1785318768175 mono_ms=51 event=write-start [REQ-CONN-POISON-ATTRIBUTION]
2026-07-29T09:52:48.1754117Z CONN_LIFECYCLE: conn=5 role=brain wall_ms=1785318768175 mono_ms=51 event=transport-close poisoned=false timed_out=false [REQ-CONN-POISON-ATTRIBUTION]
2026-07-29T09:52:48.1757322Z CONN_LIFECYCLE: conn=6 role=brain wall_ms=1785318768175 mono_ms=51 event=write-start [REQ-CONN-POISON-ATTRIBUTION]
2026-07-29T09:52:48.1759603Z CONN_LIFECYCLE: conn=6 role=brain stream-subscriber stream=1 wall_ms=1785318768175 mono_ms=52 event=stream-sub-attach stream=1 from_seq=0 [REQ-CONN-POISON-ATTRIBUTION]
2026-07-29T09:52:48.1762486Z CONN_LIFECYCLE: conn=6 role=brain stream-subscriber stream=1 viewer session=1 endpoint=reheal vid=0 wall_ms=1785318768176 mono_ms=52 event=viewer-attach session=1 vid=0 from_seq=0 [REQ-CONN-POISON-ATTRIBUTION]
2026-07-29T09:52:48.1764027Z SUBSCRIBE_DECISION: session=1 endpoint=reheal by=fd1724385aa0c75b64fb78cd602fa1d991fdebf76b13c58ed702eac835e9f618 conn=6 intent=viewer old_by=- old_gen=0 req_gen=0 decision=viewer
2026-07-29T09:52:48.1766106Z CONN_LIFECYCLE: conn=6 role=brain stream-subscriber stream=1 viewer session=1 endpoint=reheal vid=0 viewer session=1 endpoint=reheal vid=1 wall_ms=1785318768176 mono_ms=52 event=viewer-attach session=1 vid=1 from_seq=0 [REQ-CONN-POISON-ATTRIBUTION]
2026-07-29T09:52:48.1767921Z SUBSCRIBE_DECISION: session=1 endpoint=reheal by=fd1724385aa0c75b64fb78cd602fa1d991fdebf76b13c58ed702eac835e9f618 conn=6 intent=viewer old_by=- old_gen=0 req_gen=0 decision=viewer
2026-07-29T09:52:48.2323173Z 
2026-07-29T09:52:48.2323687Z running 1 test
2026-07-29T09:52:48.2563665Z NTP_TOTP_UNCORRECTED: all NTP servers unreachable — ceremony clock = raw system clock
2026-07-29T09:52:48.2797053Z CONN_LIFECYCLE: conn=1 role=brain wall_ms=1785318768279 mono_ms=0 event=transport-close poisoned=false timed_out=false [REQ-CONN-POISON-ATTRIBUTION]
2026-07-29T09:52:48.2797968Z CONN_LIFECYCLE: conn=3 role=brain wall_ms=1785318768279 mono_ms=0 event=write-start [REQ-CONN-POISON-ATTRIBUTION]
2026-07-29T09:52:48.2812078Z CONN_LIFECYCLE: conn=2 role=brain controller session=1 endpoint=reheal by=local wall_ms=1785318768281 mono_ms=1 event=controller-attach session=1 from_seq=0 [REQ-CONN-POISON-ATTRIBUTION]
2026-07-29T09:52:48.2817239Z CONN_LIFECYCLE: conn=2 role=brain controller session=1 endpoint=reheal by=local wall_ms=1785318768281 mono_ms=2 event=write-start [REQ-CONN-POISON-ATTRIBUTION]
2026-07-29T09:52:49.2334025Z CONN_LIFECYCLE: conn=4 role=brain wall_ms=1785318769233 mono_ms=953 event=write-start [REQ-CONN-POISON-ATTRIBUTION]
2026-07-29T09:52:49.2468187Z CONN_LIFECYCLE: conn=4 role=brain stream-subscriber stream=2 wall_ms=1785318769246 mono_ms=967 event=stream-sub-attach stream=2 from_seq=0 [REQ-CONN-POISON-ATTRIBUTION]
2026-07-29T09:52:49.2864674Z CONN_LIFECYCLE: conn=5 role=brain wall_ms=1785318769286 mono_ms=1006 event=write-start [REQ-CONN-POISON-ATTRIBUTION]
2026-07-29T09:52:49.2865594Z CONN_LIFECYCLE: conn=5 role=brain wall_ms=1785318769286 mono_ms=1006 event=transport-close poisoned=false timed_out=false [REQ-CONN-POISON-ATTRIBUTION]
2026-07-29T09:52:49.2868028Z CONN_LIFECYCLE: conn=6 role=brain wall_ms=1785318769286 mono_ms=1007 event=write-start [REQ-CONN-POISON-ATTRIBUTION]
2026-07-29T09:52:49.2870161Z CONN_LIFECYCLE: conn=6 role=brain stream-subscriber stream=1 wall_ms=1785318769286 mono_ms=1007 event=stream-sub-attach stream=1 from_seq=0 [REQ-CONN-POISON-ATTRIBUTION]
2026-07-29T09:52:49.2873211Z CONN_LIFECYCLE: conn=6 role=brain stream-subscriber stream=1 viewer session=1 endpoint=reheal vid=0 wall_ms=1785318769287 mono_ms=1007 event=viewer-attach session=1 vid=0 from_seq=0 [REQ-CONN-POISON-ATTRIBUTION]
2026-07-29T09:52:49.2874832Z SUBSCRIBE_DECISION: session=1 endpoint=reheal by=fd1724385aa0c75b64fb78cd602fa1d991fdebf76b13c58ed702eac835e9f618 conn=6 intent=viewer old_by=- old_gen=0 req_gen=0 decision=viewer
2026-07-29T09:52:49.2876546Z CONN_LIFECYCLE: conn=6 role=brain stream-subscriber stream=1 viewer session=1 endpoint=reheal vid=0 viewer session=1 endpoint=reheal vid=1 wall_ms=1785318769287 mono_ms=1007 event=viewer-attach session=1 vid=1 from_seq=0 [REQ-CONN-POISON-ATTRIBUTION]
2026-07-29T09:52:49.2878716Z SUBSCRIBE_DECISION: session=1 endpoint=reheal by=fd1724385aa0c75b64fb78cd602fa1d991fdebf76b13c58ed702eac835e9f618 conn=6 intent=viewer old_by=- old_gen=0 req_gen=0 decision=viewer
2026-07-29T09:52:49.6350164Z CONN_LIFECYCLE: conn=6 role=brain stream-subscriber stream=1 viewer session=1 endpoint=reheal vid=0 viewer session=1 endpoint=reheal vid=1 wall_ms=1785318769634 mono_ms=1355 event=writer-exit role=viewer session=1 reason=channel-closed [REQ-CONN-POISON-ATTRIBUTION]
2026-07-29T09:52:49.6351947Z CONN_LIFECYCLE: conn=2 role=brain controller session=1 endpoint=reheal by=local wall_ms=1785318769634 mono_ms=1355 event=writer-exit role=controller session=1 reason=channel-closed [REQ-CONN-POISON-ATTRIBUTION]
2026-07-29T09:52:49.6353561Z CONN_LIFECYCLE: conn=6 role=brain stream-subscriber stream=1 viewer session=1 endpoint=reheal vid=0 viewer session=1 endpoint=reheal vid=1 wall_ms=1785318769634 mono_ms=1355 event=writer-exit role=viewer session=1 reason=channel-closed [REQ-CONN-POISON-ATTRIBUTION]
2026-07-29T09:52:49.6355439Z CONN_LIFECYCLE: conn=6 role=brain stream-subscriber stream=1 viewer session=1 endpoint=reheal vid=0 viewer session=1 endpoint=reheal vid=1 wall_ms=1785318769634 mono_ms=1355 event=stream-sub-release stream=1 [REQ-CONN-POISON-ATTRIBUTION]
2026-07-29T09:52:49.6356741Z CONN_LIFECYCLE: conn=7 role=brain wall_ms=1785318769635 mono_ms=1355 event=transport-close poisoned=false timed_out=false [REQ-CONN-POISON-ATTRIBUTION]
2026-07-29T09:52:49.6358019Z CONN_LIFECYCLE: conn=6 role=brain stream-subscriber stream=1 viewer session=1 endpoint=reheal vid=0 viewer session=1 endpoint=reheal vid=1 wall_ms=1785318769635 mono_ms=1355 event=transport-close poisoned=false timed_out=false [REQ-CONN-POISON-ATTRIBUTION]
2026-07-29T09:52:49.6383994Z test rc::tests::attach_viewport_reconnects_across_a_broker_bounce ... ok
2026-07-29T09:52:49.6941097Z test rc::tests::establish_attach_reuses_the_probes_carried_pump_conn ... ok
2026-07-29T09:52:51.1312273Z test rc::tests::qualified_targets_attach_with_bare_wire_id ... ok
2026-07-29T09:52:51.1334873Z test roster::tests::detect_self_by_ancestry_none_when_no_ancestor_owns_a_perch ... ok
2026-07-29T09:52:51.1412691Z test roster::tests::detect_self_by_ancestry_resolves_a_live_ancestor_perch ... ok
2026-07-29T09:52:51.1443513Z test roster::tests::detect_self_id_endpoint_id_leg_is_label_only_and_perch_gated ... ok
2026-07-29T09:52:51.1578639Z test roster::tests::detect_self_id_resolves_identity_with_zero_git_spawns ... ok
2026-07-29T09:52:51.1610301Z test roster::tests::detect_self_resolves_spt_hosted_perch_via_parent_pid ... ok
2026-07-29T09:52:51.1613606Z test roster::tests::enumerate_yields_offline_corrupt_row_for_unparseable_info ... ok
2026-07-29T09:52:51.1659254Z test roster::tests::list_all_perch_dirs_enumerates_nested_psyche_for_self_resolution ... ok
2026-07-29T09:52:51.1713989Z test roster::tests::parent_pid_candidates_stay_ancestry_gated ... ok
2026-07-29T09:52:51.3833332Z test wansend::tests::remote_rest_suspends_and_wakes_with_the_deferred_gate ... ok
2026-07-29T09:52:51.4060919Z test wansend::tests::resolve_and_dial_owner_dials_the_resolved_node ... ok
2026-07-29T09:52:51.4124461Z test wansend::tests::resolve_and_dial_owner_is_honest_on_resolution_misses ... ok
2026-07-29T09:52:51.4127091Z test wansend::tests::seed_first_addr_prefers_the_cached_direct_address ... ok
2026-07-29T09:52:51.4648415Z test wansend::tests::wan_send_ships_to_the_resolved_node ... ok
2026-07-29T09:52:51.4648792Z 
2026-07-29T09:52:51.4648896Z failures:
2026-07-29T09:52:51.4649140Z 
2026-07-29T09:52:51.4649374Z ---- cli::tests::adapter_translate_proof_gates_on_commit stdout ----
2026-07-29T09:52:51.4649693Z 
2026-07-29T09:52:51.4650078Z thread 'cli::tests::adapter_translate_proof_gates_on_commit' (2681741) panicked at crates/spt/src/cli.rs:17011:13:
2026-07-29T09:52:51.4651147Z translate_proof_fixture must be built: /home/reavus/actions-runner/_work/spt-bs-core/spt-bs-core/target/debug/translate_proof_fixture (run via `cargo test -p spt`)
2026-07-29T09:52:51.4651926Z note: run with `RUST_BACKTRACE=1` environment variable to display a backtrace
2026-07-29T09:52:51.4652198Z 
2026-07-29T09:52:51.4652227Z 
2026-07-29T09:52:51.4652340Z failures:
2026-07-29T09:52:51.4652655Z     cli::tests::adapter_translate_proof_gates_on_commit
2026-07-29T09:52:51.4652946Z 
2026-07-29T09:52:51.4653277Z test result: FAILED. 448 passed; 1 failed; 0 ignored; 0 measured; 0 filtered out; finished in 30.98s
2026-07-29T09:52:51.4653616Z 
2026-07-29T09:52:51.4721447Z error: test failed, to rerun pass `-p spt --bin spt`
2026-07-29T09:52:51.4843884Z ##[error]Process completed with exit code 101.
